program: Gaussian 09
title: 000206952
version: EM64L-G09RevD.01
frameworkgroup: C1[X(C18H20N2)]
method: RPBEPBE
basis: SDD
operation: Freq
keyword: #pfreq=noraman
keyword: PBEPBE/SDD
title: #p freq=noraman PBEPBE/SDD
converged: YES YES NO NO
title: Mulliken charges:
elementType: N N C C C C C C C C C C C C C C C C C C H H H H H H H H H H H H H H H H H H H H
charge: -0.245410 -0.068253 0.373708 0.248756 0.143969 0.163212 -0.549188 0.372132 -0.517320 -0.343315 -0.317246 -0.696639 -0.321818 -0.406824 -0.286259 -0.260899 -0.250717 -0.274415 -0.623075 -0.613610 0.198483 0.214483 0.218213 0.243857 0.234383 0.249291 0.250651 0.200050 0.236585 0.233438 0.225775 0.224343 0.224325 0.228085 0.254905 0.184751 0.217802 0.220829 0.225424 0.187540
chargesum: 0.00000
title: Mulliken charges with hydrogens summed into heavy atoms:
elementType: N N C C C C C C C C C C C C C C C C C C
charge: -0.245410 -0.068253 0.373708 0.248756 0.143969 0.163212 -0.136222 0.372132 -0.299106 -0.099459 -0.082864 0.003353 -0.085234 -0.173386 -0.060484 -0.036556 -0.026391 -0.046330 0.034384 0.020183
polarizability: 2.88637579e+02 -2.78587649e+01 2.32645265e+02 1.56130960e+01 1.11262904e+01 1.36676702e+02
1716.lowfreq: -9.0222 -2.6771 0.0003 0.0004 0.0005 4.8508 37.7386 42.7114 58.0638
frequency: 37.6621 42.6431 58.0494 68.9460 87.7112 126.4538 156.0811 187.3282 216.6705 223.8053 231.0939 270.0314 277.0953 306.5139 316.7397 318.1069 329.1221 358.7789 369.3902 401.7625 409.4613 437.2458 449.0038 483.1200 539.6146 544.5291 570.0346 575.6504 601.9312 611.3454 669.3874 689.4148 733.7898 737.1794 756.2315 759.5752 771.3344 802.3793 833.0809 850.9659 853.5100 882.2057 885.1230 927.5656 939.4784 971.9626 974.1738 983.8250 1022.0391 1039.2095 1040.5262 1045.9770 1053.4231 1065.8589 1091.3760 1110.2843 1120.0698 1128.6308 1134.7235 1142.5349 1170.2904 1174.5812 1178.7121 1213.1388 1236.8916 1242.3986 1263.0316 1266.4400 1276.0089 1283.5114 1311.1546 1354.4152 1370.4368 1378.5023 1397.6074 1418.5294 1421.1843 1438.2009 1439.8512 1444.0861 1457.1177 1463.4054 1467.7579 1473.6839 1475.2799 1478.6290 1486.6329 1497.1190 1502.6383 1573.1917 1583.8834 1597.9128 1602.2366 1644.1267 2834.9832 2842.1883 2859.8090 2913.0376 2963.8459 3010.9646 3026.5923 3035.9008 3072.0688 3079.1395 3087.2252 3094.9610 3119.0402 3127.1320 3131.0990 3145.7024 3152.4584 3159.7875 3165.8389 3176.8424
redmass: 3.5659 3.6154 2.9811 4.1430 3.6328 3.3775 3.7098 3.4999 1.4400 1.7029 1.4258 3.4052 2.6616 1.9037 2.1940 2.1829 2.8812 2.2112 4.2207 4.2577 3.0508 2.8937 3.5019 3.5579 3.8173 4.0133 3.7082 4.1145 5.2168 4.9725 4.9050 4.6323 2.9345 2.3218 2.2116 1.4856 2.6260 3.7078 2.9712 1.4912 1.6128 2.9239 1.9018 1.4179 1.4158 1.3280 1.3282 1.9604 2.7653 1.7104 3.1237 3.2068 2.3113 2.3207 1.2696 1.3473 1.7578 1.6330 1.4441 1.6942 1.7318 1.0757 1.1066 2.6740 2.0948 2.9266 2.1481 2.0859 1.6161 1.7174 2.3804 1.7169 4.4094 5.7189 1.8292 1.1428 1.9193 1.7186 1.2041 1.4261 1.0478 1.0823 1.0600 1.0677 1.9145 1.2309 1.0600 2.4486 1.1011 6.2660 7.4676 6.1953 5.9124 7.8922 1.0672 1.0592 1.0589 1.0525 1.0854 1.0715 1.0719 1.0784 1.1007 1.0877 1.1008 1.1017 1.0871 1.0852 1.0882 1.0902 1.0929 1.0957 1.0998 1.0964
irintensity: 0.0203 0.1114 0.7105 0.8068 2.0210 0.6369 2.3063 1.1623 1.3019 0.2529 0.4634 1.4032 3.6621 0.8172 1.7970 0.1502 1.4923 3.6364 2.1994 3.7703 5.6703 0.0836 3.9493 2.7251 7.1243 2.6169 8.1127 9.2035 0.4564 3.7450 0.4746 2.2874 13.7997 8.0005 16.1670 113.4776 18.7786 14.0731 5.5676 4.0267 10.0866 10.1330 18.8367 1.0186 5.9300 0.4662 0.4054 10.6911 21.8817 17.2266 8.7868 6.7936 23.3723 19.0259 7.0915 6.1995 50.8567 4.9038 1.2399 10.8366 5.2870 0.7520 0.8702 6.4078 10.3257 29.2582 5.4859 17.5798 9.7496 1.1578 63.5561 18.9311 1.6379 5.9799 8.4149 4.2686 9.2908 37.3394 15.1013 5.8492 12.0229 5.1468 21.5557 22.6211 84.9841 45.0599 8.8457 14.4492 4.9647 5.4329 11.4294 16.8822 5.7638 1.2664 50.2741 91.7133 250.4652 90.3489 31.3546 43.0652 30.9913 28.3424 32.0697 18.3524 38.4243 18.1698 7.7761 1.9319 8.7812 17.7001 25.8792 32.2517 32.7656 19.7323
temp: 298.150 k
press: 1.00000 atm
elementType: 7 7 6 6 6 6 6 6 6 6 6 6 6 6 6 6 6 6 6 6 1 1 1 1 1 1 1 1 1 1 1 1 1 1 1 1 1 1 1 1
symmnumber: 1
zpe: 874487.9 jmol-1
zpe.correction: 0.333075 hartree
zpe.thermalcorrener: 0.351030 hartree
zpe.thermalcorrenthalpy: 0.351974 hartree
zpe.thermalcorrgfe: 0.287440 hartree
zpe.sumelectzpe: -805.944212 hartree
zpe.sumelectthermal: -805.926258 hartree
zpe.sumelectthermalent: -805.925313 hartree
zpe.sumelectthermalfe: -805.989847 hartree
dipole: -0.2062 -0.2006 0.8441
dipole: 0.8918
quadrupole: -108.1319 -108.3594 -119.3112
quadrupole: 5.1373 4.2183 4.9226
quadrupole: 3.8023 3.5748 -7.3771 5.1373 4.2183 4.9226
hfenergy: -806.2772873 hartree
pointgroup: C01[X(C18H20N2)]
dipole: -0.0642617 -0.1104493 0.3267686 debye
polarizability: 295.3536955|-20.0954837|224.2359281|9.9467157|19.1835406|138.3699222 unknown
InChI: InChI=1S/C18H20N2/c1-19(2)13-15-12-14-8-4-6-10-17(14)20(3)18-11-7-5-9-16(15)18/h4-12H,13H2,1-3H3
charge 0 multiplicity 1
40 atoms
N  0.995123 0.925586 1.000297
N  -3.121084 -1.678504 0.452588
C  -0.827585 -1.028327 -0.376767
C  -1.052458 0.440317 -0.375267
C  -0.160297 1.368576 0.255612
C  2.036701 0.203012 0.327477
C  -2.04569 -1.943955 -0.528876
C  1.74762 -1.032457 -0.336109
C  0.406328 -1.631209 -0.370854
C  -2.215599 0.964676 -1.006236
C  -0.451896 2.75774 0.215959
C  1.388082 1.735253 2.168009
C  3.380225 0.658391 0.390614
C  2.825261 -1.761164 -0.910607
C  -2.498722 2.344602 -1.041339
C  -1.610253 3.248772 -0.421526
C  4.432362 -0.08355 -0.189833
C  4.156343 -1.300078 -0.852114
C  -2.678682 -1.818853 1.851958
C  -4.341865 -2.449993 0.160464
H  -1.686928 -3.004608 -0.474337
H  -2.489208 -1.821334 -1.539722
H  0.411802 -2.727499 -0.465574
H  -2.929053 0.268297 -1.452799
H  0.236285 3.4646 0.68956
H  2.050104 1.131283 2.812255
H  0.482054 1.997485 2.739892
H  1.921694 2.680962 1.922913
H  3.609668 1.599897 0.898854
H  2.602552 -2.717138 -1.400642
H  -3.408421 2.705769 -1.532354
H  -1.814154 4.325485 -0.428162
H  5.46084 0.288207 -0.119488
H  4.964929 -1.886102 -1.301184
H  -1.821737 -1.150223 2.040698
H  -2.364771 -2.86258 2.111944
H  -3.501706 -1.527499 2.52869
H  -4.686365 -2.233331 -0.867722
H  -5.144591 -2.153954 0.859335
H  -4.20291 -3.558754 0.248594
