program: Gaussian 09
title: 000206943
version: EM64L-G09RevD.01
frameworkgroup: C1[X(C20H26I3N3O5)]
method: RPBEPBE
basis: SDD
operation: Freq
keyword: #p
keyword: freq=noraman
keyword: PBEPBE/SDD
title: #p freq=noraman PBEPBE/SDD
converged: NO YES NO NO
title: Mulliken charges:
elementType: I I I O O O O O N N N C C C C C C C C C C C C C C C C C C C C H H H H H H H H H H H H H H H H H H H H H H H H H H
charge: 0.172183 0.178376 0.193514 -0.258957 -0.259071 -0.216261 -0.414453 -0.213948 -0.254797 -0.264794 -0.087542 0.709739 0.701586 -0.742131 0.569182 -0.782438 -0.775705 -0.346733 -0.345596 0.204675 0.210545 0.054580 -0.466061 -0.460355 -0.664982 -0.664272 -0.449465 -0.689551 -0.677257 -0.609685 0.226957 0.263787 0.230865 0.264911 0.222598 0.238633 0.245480 0.233184 0.243021 0.220501 0.258013 0.219106 0.231887 0.244378 0.224715 0.286866 0.272286 0.208533 0.255466 0.219016 0.207273 0.235841 0.233387 0.274368 0.222310 0.277047 0.389247
chargesum: 0.00000
title: Mulliken charges with hydrogens summed into heavy atoms:
elementType: I I I O O O O O N N N C C C C C C C C C C C C C C C C C C C C
charge: 0.172183 0.178376 0.193514 -0.258957 -0.259071 -0.216261 -0.025207 -0.213948 -0.254797 -0.264794 -0.087542 0.709739 0.701586 -0.742131 0.569182 -0.782438 -0.775705 0.147919 0.141913 0.204675 0.210545 0.054580 0.018052 0.015851 0.032638 0.036708 0.109687 -0.006536 -0.000756 0.164039 0.226957
polarizability: 3.83697441e+02 6.96630834e+00 3.74841277e+02 -9.63321645e+00 7.54416592e+00 2.61973374e+02
1716.lowfreq: -21.4463 -12.6374 -11.2346 -6.5729 -5.6201 -0.0001 0.0004 0.0006 11.4811
frequency: -20.7569 -10.1795 10.5325 18.5763 19.7749 26.4959 29.6601 32.8540 36.8116 44.5826 53.1432 57.3604 58.2401 71.0941 81.4570 88.9713 90.6873 94.7682 107.5505 112.0786 112.4396 117.5468 122.1145 131.9024 161.8908 176.1904 178.9578 182.2098 188.6815 197.5440 205.3264 218.7493 225.1944 242.9831 254.8600 259.1612 278.4691 300.9716 317.5020 335.7100 343.6995 352.2914 366.0880 372.2096 386.5740 393.8948 407.4774 435.8107 473.0811 488.1087 493.8393 498.1970 527.1141 546.3013 559.3638 584.3331 601.3644 642.7254 652.1883 664.8275 676.8921 679.1812 708.1977 723.9511 755.1002 759.3822 773.2406 788.0420 797.3415 799.4214 800.6920 844.8953 882.7474 887.0711 901.7349 947.0336 993.2993 997.4657 1010.4624 1018.5450 1027.6163 1037.8191 1048.7217 1066.3208 1078.3112 1079.2210 1085.8348 1087.1872 1096.7906 1109.8257 1117.2988 1122.6765 1144.5981 1173.2448 1199.4515 1232.4144 1234.2373 1248.4780 1253.7477 1254.8304 1266.3359 1275.9466 1288.8909 1304.6263 1309.3925 1329.4187 1333.2149 1356.5703 1362.8558 1366.7639 1378.1541 1385.4169 1388.1754 1389.1157 1390.3930 1394.8573 1396.4612 1418.5933 1437.4675 1439.1372 1443.6693 1449.9928 1453.9298 1466.8429 1468.0254 1469.3862 1470.1364 1475.6069 1478.2341 1478.7623 1480.7293 1486.9142 1491.0893 1497.3496 1501.1791 1584.4979 1599.3878 1608.8543 1679.3181 2973.3409 2979.9634 2982.0802 2986.5409 2988.8741 2991.8597 2992.1153 2998.4965 3000.3317 3013.0772 3023.7337 3048.2042 3070.3068 3072.5882 3078.4640 3084.2243 3084.6122 3086.8060 3094.5274 3100.6269 3105.7415 3107.1763 3107.9546 3112.8214 3128.2494 3511.7568
redmass: 2.2408 6.3818 4.6663 4.7866 4.9437 4.0640 5.4067 2.4645 4.0816 6.1239 8.6947 4.8181 5.8006 4.3953 6.9805 4.9669 14.1420 3.8968 3.6654 4.1937 1.2648 4.8893 3.7569 4.4739 80.2920 4.2794 3.4165 5.3513 2.3369 1.2356 1.1715 1.8323 3.2653 3.1033 2.6062 2.6626 1.6154 3.0626 5.0510 4.9132 4.2048 3.2573 4.1730 3.8906 4.0897 5.2110 5.5581 5.8069 6.1696 2.4789 3.7472 5.4278 4.3092 3.8939 3.3554 4.3028 7.5696 4.0511 1.4231 4.2533 6.4509 6.0065 5.5811 10.5149 2.1258 2.1477 2.7329 1.9522 2.0283 1.4162 2.0322 4.9938 3.0061 2.8494 3.5940 2.5729 2.2844 2.0260 2.3996 4.2581 2.0208 2.4336 2.2887 2.2898 1.7409 1.7369 2.1482 2.1559 2.3892 2.4308 2.0419 1.3978 2.1843 3.6271 1.6669 2.0257 2.5014 3.2451 1.3942 1.1827 1.8643 3.7774 4.0732 2.6126 2.0477 1.7623 1.8351 1.5737 1.4077 1.4653 2.5662 2.4700 1.2092 1.2137 1.2301 1.2448 2.1418 1.2959 1.0996 1.1021 1.1171 1.0861 1.0930 1.0505 1.0394 1.0447 1.0451 1.1027 1.0574 1.0603 1.0590 1.0651 1.1356 6.9698 8.6666 8.8562 7.6556 7.7805 8.7554 1.0597 1.0682 1.0394 1.0609 1.0364 1.0368 1.0369 1.0366 1.0625 1.0595 1.0991 1.0967 1.0998 1.1035 1.0966 1.0975 1.1007 1.0979 1.1000 1.0906 1.1003 1.1016 1.0994 1.1024 1.1003 1.0642
irintensity: 0.0290 0.9198 0.2034 0.2131 0.6900 0.2667 0.5778 0.1124 0.0520 1.0827 0.6809 0.7207 1.1539 1.9566 1.2198 0.2693 0.2659 1.0790 0.8252 0.6724 0.2023 0.8092 2.6162 3.4138 0.0264 1.6832 3.1734 1.0128 0.7625 0.2415 0.9443 0.5272 2.1218 0.9202 1.3948 1.8009 0.0740 1.7660 1.3252 18.9561 3.4940 0.5352 15.4485 2.3255 7.1745 11.6222 6.4785 3.6094 19.1710 15.2649 12.4040 7.1819 9.8980 5.5988 12.4298 30.4552 8.3861 7.7835 154.6650 11.2372 15.9235 0.9108 6.0764 1.3936 13.2949 17.1815 1.2985 0.1330 7.7479 12.5643 3.8765 1.6445 7.1610 7.9449 7.8326 23.2345 1.6451 3.4138 5.9616 2.5812 31.6895 193.0205 51.5652 35.4677 2.8953 0.9124 9.3927 7.9338 46.8225 29.7194 29.4409 9.8691 81.0682 36.2551 78.8560 84.0815 196.9147 6.9462 23.5608 1.6277 20.4506 18.2514 15.5339 36.0363 79.1201 24.4789 50.3289 28.5364 11.3067 26.4438 211.2810 92.4636 25.9368 26.5270 17.4094 22.3608 51.0929 96.4491 40.8567 4.2023 15.3071 12.7874 17.3976 8.6060 8.5699 15.8920 12.6496 19.2964 6.7586 20.1932 12.1455 9.6410 18.7864 10.5288 9.8980 254.7621 246.4748 237.5176 171.8713 28.3784 13.6544 52.6417 18.6133 20.9302 50.0146 5.7480 33.5349 19.2429 16.3954 3.9551 15.1602 6.5391 1.2407 9.0624 34.7593 29.1774 36.7854 23.4169 2.8248 19.9053 18.5063 20.8607 20.7605 0.3172 27.7552
temp: 298.150 k
press: 1.00000 atm
elementType: 53 53 53 8 8 8 8 8 7 7 7 6 6 6 6 6 6 6 6 6 6 6 6 6 6 6 6 6 6 6 6 1 1 1 1 1 1 1 1 1 1 1 1 1 1 1 1 1 1 1 1 1 1 1 1 1 1
symmnumber: 1
zpe: 1136428.6 jmol-1
zpe.correction: 0.432843 hartree
zpe.thermalcorrener: 0.468542 hartree
zpe.thermalcorrenthalpy: 0.469486 hartree
zpe.thermalcorrgfe: 0.357493 hartree
zpe.sumelectzpe: -1350.285942 hartree
zpe.sumelectthermal: -1350.250242 hartree
zpe.sumelectthermalent: -1350.249298 hartree
zpe.sumelectthermalfe: -1350.361291 hartree
dipole: 1.0335 -1.9788 2.5457
dipole: 3.3859
quadrupole: -250.1304 -231.6293 -219.4030
quadrupole: -10.9524 14.8250 -13.3115
quadrupole: -16.4095 2.0916 14.3179 -10.9524 14.8250 -13.3115
hfenergy: -1350.7187844 hartree
pointgroup: C01 [X(C20H26I3N3O5)]
dipole: 0.8071047 0.6232123 -0.8571762 debye
polarizability: 370.7421292|-9.5619909|379.9360628|30.8810387|5.2264267|269.8338998 unknown
InChI: InChI=1S/C20H26I3N3O5/c1-6-11(27)25(8-3)18-15(21)14(20(31)24(5)10-13(29)30)16(22)19(17(18)23)26(9-4)12(28)7-2/h29H,6-10H2,1-5H3
charge 0 multiplicity 1
57 atoms
I  -3.16011 -1.803897 -0.559327
I  -0.528249 3.647429 0.616029
I  2.618287 -1.546859 1.550589
O  0.288671 -4.786331 -0.44551
O  -4.274822 2.431507 -1.602735
O  2.002638 1.912013 2.78758
O  3.222149 0.223667 -2.497138
O  4.885488 0.58093 -0.909043
N  -0.223529 -2.779177 0.593473
N  -2.859294 1.397047 -0.072786
N  2.859725 2.10802 0.620892
C  -0.316732 -1.349661 0.593645
C  -1.617963 0.754802 0.243059
C  -1.504688 -0.669005 0.202646
C  0.742264 0.859487 1.017462
C  -0.467427 1.49644 0.640498
C  0.794253 -0.555167 1.005348
C  -0.37265 -3.503064 1.898222
C  -3.926919 1.406743 0.975172
C  0.171192 -3.529249 -0.534179
C  -3.160003 1.885889 -1.364786
C  1.920678 1.669721 1.547186
C  0.439447 -2.772805 -1.839698
C  -2.084352 1.689385 -2.440946
C  -1.74448 -4.173017 2.102023
C  -3.724461 2.442762 2.095295
C  2.742272 1.861454 -0.816643
C  1.513399 -3.479103 -2.692721
C  -2.560271 2.156383 -3.828001
C  4.012395 2.905717 1.088053
C  3.751515 0.838502 -1.355597
H  0.415364 -4.276185 1.919913
H  -0.167739 -2.776403 2.704472
H  -4.865886 1.612163 0.433506
H  -3.992276 0.389718 1.40593
H  0.728934 -1.725196 -1.641834
H  -0.515759 -2.736924 -2.401693
H  -1.173122 2.245757 -2.143914
H  -1.80086 0.61835 -2.470075
H  -1.72235 -4.758275 3.040263
H  -1.961726 -4.864651 1.271528
H  -2.561506 -3.435604 2.17613
H  -2.787068 2.274214 2.654268
H  -3.710046 3.468531 1.691557
H  -4.564053 2.363873 2.810755
H  1.729829 1.517097 -1.074536
H  2.908931 2.807679 -1.371686
H  1.614015 -2.981842 -3.674126
H  1.241752 -4.535209 -2.853064
H  2.494787 -3.462131 -2.185239
H  -1.759779 2.014013 -4.576126
H  -2.842875 3.222235 -3.808208
H  -3.450047 1.589752 -4.150385
H  4.954499 2.392716 0.832929
H  3.99674 3.907802 0.617868
H  3.931514 3.015579 2.179678
H  3.885904 -0.413425 -2.879176
