program: Gaussian 09
title: 000206942
version: EM64L-G09RevD.01
frameworkgroup: C1[X(C20H26I3N3O5)]
method: RPBEPBE
basis: SDD
operation: Freq
keyword: #p
keyword: freq=noraman
keyword: PBEPBE/SDD
title: #p freq=noraman PBEPBE/SDD
converged: YES YES NO NO
title: Mulliken charges:
elementType: I I I O O O O O N N N C C C C C C C C C C C C C C C C C C C C H H H H H H H H H H H H H H H H H H H H H H H H H H
charge: 0.180023 0.154691 0.181259 -0.408646 -0.209142 -0.254170 -0.257935 -0.258198 -0.311321 -0.252138 -0.250260 -0.105938 -0.420389 -0.376911 0.718515 0.721623 0.567217 -0.719203 -0.788533 -0.761469 0.022780 -0.348720 -0.343822 0.174198 -0.691466 0.188824 0.191423 -0.661374 -0.664499 -0.764661 -0.765840 0.277207 0.259546 0.241813 0.215039 0.214904 0.351421 0.262155 0.229573 0.223720 0.262860 0.216896 0.217562 0.243473 0.220872 0.257096 0.218598 0.218733 0.259325 0.225769 0.247188 0.244531 0.266454 0.245528 0.246285 0.265836 0.381699
chargesum: 0.00000
title: Mulliken charges with hydrogens summed into heavy atoms:
elementType: I I I O O O O O N N N C C C C C C C C C C C C C C C C C C C C
charge: 0.180023 0.154691 0.181259 -0.026947 -0.209142 -0.254170 -0.257935 -0.258198 0.040100 -0.252138 -0.250260 0.171269 0.080970 0.053031 0.718515 0.721623 0.567217 -0.719203 -0.788533 -0.761469 0.022780 0.143008 0.142758 0.174198 -0.013535 0.188824 0.191423 0.035192 0.039328 -0.006489 -0.008192
polarizability: 4.06970979e+02 -8.55671074e+00 3.83716464e+02 1.97648199e+01 2.99708655e+00 2.37395224e+02
1716.lowfreq: -6.4514 -1.7708 0.0000 0.0001 0.0005 2.0588 14.2048 19.1948 21.7858
frequency: 13.8202 19.0878 21.5613 26.8340 31.9419 38.2726 43.0639 46.9340 51.4516 55.5805 56.1804 68.6526 70.6244 83.6722 87.5791 94.0573 95.4056 96.0275 100.5182 102.3757 108.6413 128.2111 130.7144 139.5300 141.4436 161.8612 173.2781 184.2765 188.6094 200.4264 213.5262 220.9179 228.8132 243.5700 255.5353 269.0466 272.4650 292.5050 319.5129 323.1341 344.0000 356.3484 371.4769 382.1612 397.0041 411.8416 452.4205 467.5384 471.7606 477.4649 501.7191 531.6159 554.5539 579.8428 582.0568 600.7863 608.3506 613.9909 618.7509 631.7290 672.8285 675.5764 699.4708 713.5258 732.6756 741.3449 748.3700 762.0014 773.0098 787.3255 804.2296 845.5804 911.3875 911.5604 919.4173 935.6540 988.9294 989.8312 998.8339 1009.4352 1016.9167 1030.5995 1031.0458 1032.8053 1052.5616 1064.9875 1080.2494 1086.8604 1087.7820 1103.6820 1106.6457 1117.0355 1132.1883 1150.4778 1181.2431 1215.8127 1231.6227 1241.0410 1274.8634 1275.9934 1277.6657 1278.9380 1280.6123 1301.2259 1307.1085 1317.7075 1326.2739 1350.3097 1362.9662 1365.1477 1374.4332 1377.4365 1378.1575 1379.4081 1386.1216 1386.9294 1388.2850 1402.2339 1439.8898 1442.0515 1445.7235 1447.2633 1448.7090 1466.0474 1467.2427 1468.6190 1469.6304 1470.1807 1475.7013 1482.4526 1482.7972 1483.7207 1487.8210 1501.7932 1502.9072 1604.1366 1608.3265 1609.9126 1638.0387 2976.8730 2988.3406 2990.5672 2991.0350 2992.3550 2993.4053 3012.7910 3014.5023 3016.6162 3024.4487 3035.4155 3072.7138 3074.2043 3077.8914 3079.2801 3081.0824 3086.1534 3087.4626 3093.6366 3099.4938 3111.7483 3113.9231 3129.7794 3131.4283 3498.2074 3537.0605
redmass: 6.8089 6.7011 4.8184 5.6060 5.1092 3.9908 4.5376 3.3891 6.0814 1.8572 4.0266 4.7974 4.9041 2.2859 5.2004 4.6996 3.0210 6.0793 3.7198 1.8347 7.3346 3.2239 3.0214 4.5042 4.0308 89.9572 5.2329 4.2648 3.2015 3.0226 1.6402 2.7928 2.4662 2.1892 1.7872 2.3388 2.0392 2.6161 2.9453 5.6777 3.5589 3.5901 3.8663 4.1544 5.7946 5.6842 5.4572 4.1746 3.7794 4.0491 5.1271 6.0695 3.7175 2.3244 3.6100 3.3995 1.4609 1.7528 3.8064 3.4914 8.4105 7.1124 3.1908 4.2260 7.6522 2.0309 2.6291 1.7077 3.5943 1.6426 1.9061 2.6824 2.5429 2.5746 1.8976 3.2727 1.7851 1.7359 1.9325 3.8871 7.0469 2.3172 1.8013 1.6834 2.7368 3.0388 2.8476 2.0935 2.4590 2.8959 2.1019 2.8369 2.0194 2.0653 3.0816 1.8885 1.5849 1.4221 1.3632 2.0627 2.4009 1.9089 2.2169 3.0623 3.1506 3.2603 1.4129 1.3417 1.2937 1.2821 1.2798 1.3830 1.6137 2.4922 1.4795 1.2860 1.8758 1.2073 1.1208 1.1132 1.1297 1.0831 1.0702 1.0503 1.0482 1.0523 1.1112 1.0500 1.0416 1.0858 1.2604 1.3545 1.1114 9.6691 7.4413 8.3621 7.1931 7.2666 7.6868 1.0592 1.0376 1.0363 1.0376 1.0365 1.0374 1.0593 1.0598 1.0758 1.0752 1.0940 1.1037 1.1029 1.0979 1.0998 1.0979 1.0980 1.0974 1.1039 1.0995 1.1025 1.1027 1.0988 1.0989 1.0638 1.0784
irintensity: 0.1273 0.2891 0.4572 0.0701 0.2249 0.1107 2.3146 2.0248 1.2484 0.8639 1.7595 2.7183 0.7623 1.5276 0.9615 1.5040 0.1582 0.0797 0.2635 0.5102 2.6872 1.8264 0.5764 3.0845 3.8169 0.0014 1.4933 0.8771 0.5132 4.0852 2.8083 1.4033 0.2076 0.4515 0.3398 1.4755 0.4569 4.5714 0.9531 18.0500 1.3797 1.3894 4.0713 1.3813 0.2633 1.4378 30.1493 2.0048 14.3991 7.2775 43.0771 12.5108 2.4442 12.0561 19.4875 13.3570 103.3012 87.2569 10.3101 37.4497 3.9701 2.1445 41.2360 21.3046 2.5408 22.9162 32.2376 8.5907 3.3044 0.3931 1.5282 8.0178 7.7532 3.8601 7.0023 5.4688 13.5831 29.6922 7.7313 17.5449 6.8835 0.7478 3.2848 8.1917 169.6985 8.5536 22.9730 11.6762 4.8484 44.2015 9.8535 24.3489 33.2795 11.0493 21.7402 33.1230 48.5650 42.8796 2.0360 85.7127 63.3258 123.1023 98.9919 123.4299 29.0619 45.9009 10.0595 6.1751 1.9601 3.6719 9.9031 34.1301 44.1635 271.0195 66.6057 4.8620 128.5561 13.3152 30.5476 47.1922 11.2055 19.7063 13.8707 10.9432 7.9059 28.7708 30.2753 7.3570 8.9721 34.9803 27.3494 119.3773 49.6393 11.6099 63.2018 184.6418 345.0038 173.7725 180.4403 24.6750 29.7495 24.2718 10.5611 25.0343 6.0101 18.3823 16.2970 7.9343 20.9866 14.4647 2.2384 1.3259 6.2713 46.4558 5.1005 36.6034 34.0913 2.6673 27.4420 20.5241 19.9341 10.3152 10.7161 26.1927 40.4333
temp: 298.150 k
press: 1.00000 atm
elementType: 53 53 53 8 8 8 8 8 7 7 7 6 6 6 6 6 6 6 6 6 6 6 6 6 6 6 6 6 6 6 6 1 1 1 1 1 1 1 1 1 1 1 1 1 1 1 1 1 1 1 1 1 1 1 1 1 1
symmnumber: 1
zpe: 1139352.2 jmol-1
zpe.correction: 0.433956 hartree
zpe.thermalcorrener: 0.471106 hartree
zpe.thermalcorrenthalpy: 0.472050 hartree
zpe.thermalcorrgfe: 0.356975 hartree
zpe.sumelectzpe: -1350.304934 hartree
zpe.sumelectthermal: -1350.267784 hartree
zpe.sumelectthermalent: -1350.266840 hartree
zpe.sumelectthermalfe: -1350.381916 hartree
dipole: -4.8471 -0.5951 0.5832
dipole: 4.9182
quadrupole: -213.5518 -248.2304 -229.5563
quadrupole: 9.2919 -16.5470 -1.2208
quadrupole: 16.8943 -17.7842 0.8899 9.2919 -16.5470 -1.2208
hfenergy: -1350.7388904 hartree
pointgroup: C01[X(C20H26I3N3O5)]
dipole: 1.9165037 -0.2382652 -0.1196774 debye
polarizability: 404.5004727|10.2099847|383.0700879|27.7808856|-10.1106363|240.5121067 unknown
InChI: InChI=1S/C20H26I3N3O5/c1-6-12(20(30)31)9-24-19(29)13-14(21)17(25(7-2)10(4)27)16(23)18(15(13)22)26(8-3)11(5)28/h12,24,30H,6-9H2,1-5H3
charge 0 multiplicity 1
57 atoms
I  -4.289828 1.2388 -0.615893
I  1.653418 2.169147 0.700626
I  -0.601053 -3.557062 0.561477
O  5.367043 1.259481 -1.024932
O  1.845649 -1.270939 2.233991
O  4.131468 -0.34359 -2.147501
O  -4.743998 -3.180358 -1.258432
O  -1.563397 4.745432 -1.197929
N  2.409894 -1.395293 -0.027927
N  -3.313834 -1.864524 0.009945
N  -1.52386 2.783462 0.039333
C  4.84788 -0.784875 0.182912
C  3.770604 -1.901026 0.194963
C  6.269713 -1.417881 0.338062
C  -2.214093 -0.953947 0.119479
C  -1.29809 1.372055 0.140082
C  0.196847 -0.560502 0.588068
C  -2.377578 0.453456 -0.036147
C  -0.015459 0.834065 0.449925
C  -0.904097 -1.433584 0.417251
C  1.557573 -1.104021 1.01131
C  -3.934175 -2.393275 1.266307
C  -2.17781 3.494019 1.185238
C  4.728372 0.018951 -1.103398
C  7.382105 -0.426534 0.734624
C  -3.768025 -2.376704 -1.222765
C  -1.305293 3.507982 -1.150044
C  -5.213574 -1.654737 1.70254
C  -1.21323 4.329031 2.048371
C  -3.009488 -1.947781 -2.473241
C  -0.780157 2.729883 -2.351169
H  4.675091 -0.096313 1.030986
H  3.784391 -2.395901 1.180607
H  3.999622 -2.647435 -0.586359
H  6.18607 -2.199293 1.119542
H  6.537602 -1.941859 -0.60098
H  2.136524 -1.188261 -0.991788
H  -4.172796 -3.453601 1.073314
H  -3.166706 -2.349551 2.059553
H  -2.686435 2.729685 1.799316
H  -2.947307 4.156041 0.750324
H  7.1513 0.058714 1.700824
H  8.346784 -0.954757 0.842527
H  7.50566 0.371083 -0.01689
H  -5.640503 -2.164113 2.586625
H  -5.965119 -1.677349 0.896237
H  -5.014803 -0.604018 1.974354
H  -1.795015 4.866188 2.820652
H  -0.692296 5.07777 1.429306
H  -0.463539 3.699357 2.556046
H  -1.941833 -2.225389 -2.406605
H  -3.073015 -0.857147 -2.634954
H  -3.461506 -2.460942 -3.33441
H  -1.450648 1.891149 -2.613234
H  0.226265 2.316528 -2.15932
H  -0.722835 3.423397 -3.202761
H  5.26132 1.739185 -1.89234
