program: Gaussian 09
title: 000206940
version: EM64L-G09RevD.01
frameworkgroup: C1[X(C19H24I3N3O5)]
method: RPBEPBE
basis: SDD
operation: Freq
keyword: #p
keyword: freq=noraman
keyword: PBEPBE/SDD
title: #p freq=noraman PBEPBE/SDD
converged: NO YES NO NO
title: Mulliken charges:
elementType: I I I O O O O O N N N C C C C C C C C C C C C C C C C C C C H H H H H H H H H H H H H H H H H H H H H H H H
charge: 0.180387 0.167115 0.192445 -0.211482 -0.257827 -0.257107 -0.416849 -0.213192 -0.248920 -0.250204 -0.089083 0.718320 0.719266 0.569661 -0.735965 -0.784818 -0.761724 0.043248 -0.346416 -0.344858 -0.334441 -0.460373 0.189240 0.190273 -0.663011 -0.663219 -0.663249 -0.775136 -0.764901 0.230194 0.263651 0.228445 0.262547 0.225197 0.260383 0.250624 0.270544 0.284531 0.218561 0.260316 0.218790 0.226044 0.257485 0.220504 0.228186 0.255323 0.205699 0.254068 0.245782 0.263352 0.246032 0.241137 0.267355 0.388071
chargesum: 0.00000
title: Mulliken charges with hydrogens summed into heavy atoms:
elementType: I I I O O O O O N N N C C C C C C C C C C C C C C C C C C C
charge: 0.180387 0.167115 0.192445 -0.211482 -0.257827 -0.257107 -0.028778 -0.213192 -0.248920 -0.250204 -0.089083 0.718320 0.719266 0.569661 -0.735965 -0.784818 -0.761724 0.043248 0.145680 0.142886 0.176566 0.094702 0.189240 0.190273 0.034656 0.040814 0.025959 -0.011933 -0.010377 0.230194
polarizability: 3.76768995e+02 -1.77957018e+00 3.78630131e+02 1.55442394e+01 1.40216539e+00 2.36144545e+02
1716.lowfreq: -15.5282 -10.5189 -9.1134 -0.0006 -0.0005 0.0003 3.0814 8.4225 16.0214
frequency: -9.3124 7.9992 14.6252 18.7447 22.3328 33.3631 37.5161 42.2625 45.5881 51.7193 54.7835 59.4161 72.0440 72.3895 83.3113 87.8067 92.5258 93.7721 98.8291 114.0033 126.9745 129.6177 133.7987 138.4650 141.5188 161.9836 179.9667 184.1369 204.9837 211.6782 224.6867 230.7978 240.6703 262.1269 280.8774 301.4247 319.9309 323.6186 339.2000 367.1737 376.0541 382.1464 387.0779 407.1867 428.9021 458.7351 473.3260 475.1475 486.8072 498.2938 525.8678 555.3909 579.1914 588.1556 597.9694 621.3291 627.5918 656.9655 672.6621 675.8567 699.7713 722.5164 747.2051 752.7064 771.1977 783.0665 786.1863 793.5438 844.2676 857.9729 910.6943 911.4329 936.9088 975.3856 988.4559 989.4736 1014.5000 1020.5780 1029.4184 1030.1798 1030.7760 1045.1110 1081.1957 1082.7141 1088.9592 1098.4122 1115.9030 1126.5744 1151.5109 1181.6794 1192.6472 1223.4385 1258.6105 1273.7858 1275.3553 1277.9360 1284.0809 1300.9341 1307.5277 1314.4541 1350.2372 1361.2157 1362.5581 1363.4594 1373.8076 1375.6071 1378.7002 1385.5678 1386.0427 1386.7738 1389.7612 1414.7239 1436.1193 1442.7171 1446.2444 1447.0796 1449.8661 1464.4337 1464.7537 1466.7228 1467.0934 1470.4303 1474.6053 1479.5565 1483.7489 1483.9683 1498.1694 1501.8985 1578.9270 1608.1104 1609.0938 1676.8251 2981.9520 2983.9538 2991.0996 2992.0794 2992.1064 2992.6502 3011.0649 3012.3869 3035.3361 3071.3483 3071.8674 3072.7545 3078.5395 3079.3270 3087.6269 3087.7541 3092.0139 3100.9962 3108.6684 3112.7041 3114.4875 3128.6906 3129.7762 3506.0895
redmass: 2.9983 7.1719 2.6218 3.6026 5.5767 2.0626 6.5694 3.9829 2.6631 3.3795 2.1849 5.9869 4.2360 2.7777 5.8177 4.5065 6.6613 11.7673 5.4144 6.4173 4.0767 3.2854 4.8152 4.3728 4.4374 93.2565 4.9662 4.0756 2.0865 1.3297 2.3069 2.7797 2.7967 2.5225 1.7417 2.5844 3.0561 3.0059 4.3823 3.2424 3.3847 3.6182 4.2637 5.2633 5.8605 4.2366 3.5249 4.2767 2.5806 5.8373 5.7973 3.8291 3.5758 4.4116 5.1146 4.3247 4.3118 1.4531 6.4638 6.6261 3.9203 11.0569 2.6395 2.4395 2.2027 1.7392 1.6565 2.3203 4.1661 3.3455 2.5379 2.5611 2.8708 2.5266 1.7827 1.7245 4.6324 3.5208 1.6829 1.8936 2.2405 2.4376 2.1285 2.8755 2.1049 2.2364 2.7951 2.1308 2.0004 3.0077 1.8149 2.4070 1.7842 1.9100 2.6932 3.3584 2.4674 2.3235 2.9735 2.9434 1.3069 1.3841 1.4286 1.3117 1.3132 2.0586 1.5195 1.2168 1.5240 1.7788 1.2602 2.7310 1.0915 1.1180 1.1072 1.1048 1.0600 1.0544 1.0504 1.0930 1.0499 1.0626 1.0514 1.0692 1.0574 1.0550 10.0749 9.4156 7.8315 7.2055 7.2315 8.8213 1.0674 1.0376 1.0375 1.0366 1.0371 1.0366 1.0595 1.0594 1.0607 1.0985 1.1038 1.1035 1.0979 1.0978 1.0979 1.0977 1.1004 1.0919 1.1044 1.1026 1.1025 1.0989 1.0987 1.0641
irintensity: 0.4454 0.5484 0.2536 0.5927 0.1251 0.4403 0.5487 0.7846 0.7381 1.1486 0.3879 0.9426 0.4020 1.7090 2.0926 0.0755 0.2334 0.2061 0.4213 0.0562 1.4616 2.9551 1.2950 2.0583 5.8060 0.0277 0.6973 0.7236 1.7818 1.7119 2.2312 0.5933 1.8191 0.0792 0.6093 1.7943 7.2894 8.0254 6.2425 5.6270 10.7756 1.5606 1.5341 1.0391 1.8391 8.3905 7.4929 3.0040 25.3692 25.0076 14.9340 0.8600 13.5532 35.4619 5.2415 4.0048 10.4546 138.6190 20.8150 9.4988 5.1083 1.0187 36.4870 7.3913 4.7870 0.8995 0.7190 16.7376 4.7481 5.7151 6.3709 4.8535 19.6548 18.8175 11.9217 33.3696 2.8573 6.2621 5.7980 1.8722 2.3601 213.1293 34.4716 9.8687 9.5423 53.5863 25.1872 11.3514 14.7485 19.8121 126.7405 5.7081 10.7819 78.4563 22.3616 186.3590 75.1617 108.2386 47.4888 36.0706 5.7765 6.0909 12.1390 6.5840 15.8173 186.7947 134.8875 16.8404 79.5647 70.3518 27.7354 94.1579 22.8322 39.5319 25.8998 2.9369 20.4642 17.7180 5.8610 23.2454 19.2137 6.5466 11.4826 27.4413 15.9792 11.7578 11.8259 8.5144 235.6121 382.2247 137.4791 181.4049 12.5705 25.5549 10.4067 17.4429 13.9153 24.1537 16.3940 17.8803 8.1410 30.0577 2.4434 1.2037 7.2997 3.8371 36.9578 32.9342 24.3057 2.7867 13.2886 19.8528 19.2039 10.8079 10.5224 29.6093
temp: 298.150 k
press: 1.00000 atm
elementType: 53 53 53 8 8 8 8 8 7 7 7 6 6 6 6 6 6 6 6 6 6 6 6 6 6 6 6 6 6 6 1 1 1 1 1 1 1 1 1 1 1 1 1 1 1 1 1 1 1 1 1 1 1 1
symmnumber: 1
zpe: 1062717.4 jmol-1
zpe.correction: 0.404768 hartree
zpe.thermalcorrener: 0.439990 hartree
zpe.thermalcorrenthalpy: 0.440934 hartree
zpe.thermalcorrgfe: 0.329005 hartree
zpe.sumelectzpe: -1311.066097 hartree
zpe.sumelectthermal: -1311.030875 hartree
zpe.sumelectthermalent: -1311.029931 hartree
zpe.sumelectthermalfe: -1311.141860 hartree
dipole: -2.7248 0.7591 2.0864
dipole: 3.5148
quadrupole: -220.8094 -247.0413 -215.0728
quadrupole: -8.2419 -20.1602 -2.1935
quadrupole: 6.8318 -19.4001 12.5684 -8.2419 -20.1602 -2.1935
hfenergy: -1311.4708648 hartree
pointgroup: C01 [X(C19H24I3N3O5)]
dipole: -1.1574318 -0.2818104 -0.7022672 debye
polarizability: 370.9725594|3.4996874|378.2392838|-31.7290157|7.9102298|242.3318277 unknown
InChI: InChI=1S/C19H24I3N3O5/c1-6-23(9-12(28)29)19(30)13-14(20)17(24(7-2)10(4)26)16(22)18(15(13)21)25(8-3)11(5)27/h28H,6-9H2,1-5H3
charge 0 multiplicity 1
54 atoms
I  3.892443 0.283022 -0.684766
I  -0.946762 -3.36357 0.412318
I  -1.435412 2.7008 1.268631
O  -2.423918 -0.682459 2.545076
O  2.105892 4.514286 -0.736219
O  2.935429 -3.964109 -1.819143
O  -2.741615 1.45829 -2.658927
O  -4.520123 1.774904 -1.193749
N  1.677472 2.511295 0.352461
N  2.14057 -2.406069 -0.294073
N  -3.302531 -0.429611 0.399237
C  1.114401 1.193781 0.36241
C  1.324091 -1.273813 0.027423
C  -0.837662 -0.294886 0.766618
C  1.872672 0.044672 -0.002223
C  -0.041533 -1.412454 0.408826
C  -0.24433 0.990591 0.746381
C  -2.252616 -0.485369 1.304582
C  2.099711 3.130878 1.650534
C  3.102214 -2.919705 0.733249
C  -4.686873 -0.6380 0.908678
C  -3.110525 -0.280216 -1.044674
C  1.669469 3.328482 -0.796967
C  2.179944 -2.977809 -1.582001
C  3.62533 3.220938 1.839129
C  2.60876 -4.162784 1.496914
C  -5.11078 -2.120357 0.859498
C  1.10325 2.725322 -2.077449
C  1.299527 -2.34282 -2.652368
C  -3.560126 1.083896 -1.585681
H  1.668971 4.147878 1.6730
H  1.636818 2.541904 2.462083
H  4.033302 -3.167952 0.194189
H  3.315834 -2.090315 1.430884
H  -4.701929 -0.280359 1.951303
H  -5.360402 0.002171 0.31467
H  -3.695529 -1.054795 -1.581074
H  -2.055824 -0.429489 -1.317651
H  4.094508 2.224574 1.894896
H  4.080388 3.785333 1.008896
H  3.841087 3.759378 2.780785
H  1.724772 -3.943511 2.118875
H  2.356612 -4.971214 0.790999
H  3.417172 -4.523388 2.159851
H  -6.148649 -2.223274 1.224288
H  -4.455412 -2.731472 1.502841
H  -5.074898 -2.528881 -0.167966
H  0.069051 2.361159 -1.939122
H  1.719527 1.878184 -2.428408
H  1.111208 3.509419 -2.848756
H  1.460731 -1.252207 -2.722919
H  0.228897 -2.520972 -2.443946
H  1.551948 -2.809664 -3.615601
H  -3.064347 2.318366 -3.045148
