program: Gaussian 09
title: 000206848
version: EM64L-G09RevD.01
frameworkgroup: C1[X(C18H24N2O4)]
method: RPBEPBE
basis: SDD
operation: Freq
keyword: #p
keyword: freq=noraman
keyword: PBEPBE/SDD
title: #p freq=noraman PBEPBE/SDD
converged: YES YES NO NO
title: Mulliken charges:
elementType: O O O O N N C C C C C C C C C C C C C C C C C C H H H H H H H H H H H H H H H H H H H H H H H H
charge: -0.228575 -0.265787 -0.184882 -0.216580 -0.486503 -0.492719 0.399289 -0.000175 -0.620563 -0.096121 0.171137 -0.423510 -0.766453 0.207758 -0.734093 -0.722993 -0.692819 0.274457 0.486367 -0.445388 -0.335907 -0.196585 -0.215080 -0.254894 0.286578 0.238368 0.214034 0.227921 0.221440 0.230408 0.246031 0.247393 0.254362 0.213888 0.211053 0.236135 0.224285 0.216411 0.221395 0.227331 0.252804 0.347052 0.312963 0.221742 0.304027 0.227449 0.227767 0.229782
chargesum: 0.00000
title: Mulliken charges with hydrogens summed into heavy atoms:
elementType: O O O O N N C C C C C C C C C C C C C C C C C C
charge: -0.228575 -0.265787 -0.184882 -0.216580 -0.139450 -0.179756 0.399289 -0.000175 -0.095618 0.117913 0.171137 0.025851 -0.042621 0.207758 -0.054790 -0.046162 0.008712 0.274457 0.486367 -0.223646 -0.031880 0.030865 0.012687 -0.025112
polarizability: 3.27337823e+02 -1.32329119e+01 1.94514287e+02 6.27021085e+00 -2.35278645e+01 1.66240395e+02
1716.lowfreq: -12.9015 -5.9536 -2.3059 -0.0008 0.0007 0.0010 16.4540 19.3493 36.9529
frequency: 16.0345 19.2130 36.9364 44.0209 66.1476 73.2610 82.7514 86.3875 101.4454 118.6236 144.3426 149.8149 161.0257 203.5650 205.0557 217.2851 228.3380 238.6295 252.6501 254.2476 261.7431 280.4785 297.0485 317.4279 321.9727 341.6994 376.1142 385.1318 396.6553 407.5812 421.3531 455.1837 489.5482 507.0559 546.1200 591.0835 601.1690 606.0119 613.6395 617.0380 660.1759 693.6367 695.6507 703.3513 730.5269 759.8544 767.8392 784.6408 787.3698 816.1864 828.8737 842.1023 850.0223 881.1473 904.4623 917.1156 921.7362 936.0343 952.2902 958.6551 961.4283 967.7738 972.7610 985.0181 999.1136 1014.2823 1028.3414 1035.4325 1073.5969 1090.8198 1095.0419 1105.9436 1121.5003 1137.7121 1152.4195 1164.7929 1173.2135 1177.8122 1190.4976 1200.3733 1204.9393 1210.8772 1265.7291 1275.2267 1285.3939 1307.0491 1321.3994 1321.8576 1323.1928 1351.0989 1380.2341 1384.3143 1392.6111 1400.9195 1404.3542 1429.8927 1459.5025 1464.9509 1468.4484 1470.9882 1473.9544 1478.3616 1479.4761 1482.0005 1484.8318 1487.8015 1493.6240 1495.9968 1522.4953 1602.2309 1616.0301 1619.4847 1657.4605 1683.5464 2971.1125 2982.2176 2984.8376 2988.1554 2990.0280 2999.6831 3016.0490 3046.4770 3071.3113 3078.5885 3081.2302 3084.7947 3085.9598 3090.0237 3091.7152 3097.8016 3107.8264 3110.5631 3133.3653 3145.8270 3166.3551 3196.4866 3328.5476 3516.2496
redmass: 4.7276 4.2659 5.3508 4.6107 3.8019 5.5165 2.9578 4.6444 4.1166 3.1352 6.7239 4.1717 3.5212 1.6262 1.0818 2.9636 3.1868 1.2408 1.5171 1.9144 2.8108 2.9111 2.6545 4.3323 3.5653 5.3100 2.7625 4.4049 3.5258 2.9245 3.0783 2.8250 4.1688 2.5687 6.2188 4.6808 2.0228 1.7649 6.0037 4.1257 8.1661 8.3797 2.0284 5.1113 4.2829 4.2078 1.6838 1.4182 1.3559 4.0763 2.9513 1.2690 2.9277 3.0063 3.2926 1.4334 1.2326 1.8089 1.8210 5.5294 1.6809 2.5585 1.3562 6.0138 1.3094 1.9652 2.1198 1.7362 2.5079 1.5637 2.1845 1.8290 2.6605 2.5762 3.7988 2.2146 1.0534 2.8251 1.1167 2.4822 1.9298 3.3930 2.1985 1.9760 1.3990 1.4975 1.5001 1.4330 1.4403 1.3939 1.2028 6.3251 1.2368 1.1983 1.2040 2.3252 1.0684 1.0672 1.0601 1.0550 1.0653 1.0456 1.3576 1.1593 1.3883 1.0479 1.0912 1.7088 2.1202 5.2391 6.0785 10.0467 3.7152 7.0063 1.0836 1.0358 1.0363 1.0533 1.0439 1.0363 1.0618 1.1005 1.0994 1.0994 1.0993 1.0998 1.1018 1.1008 1.0986 1.0996 1.1001 1.0888 1.0868 1.0933 1.0999 1.0950 1.0803 1.0766
irintensity: 0.2060 2.0723 2.3449 0.8970 0.6819 4.6146 0.6983 0.2578 5.3000 0.8113 11.0554 4.6667 3.7544 0.1039 0.2544 3.5008 1.3701 0.0289 0.5417 0.7015 5.1896 3.4757 2.3764 3.8936 0.7398 4.9329 4.8768 0.3014 2.7460 0.0269 0.2582 0.7905 5.2269 29.0200 32.9645 3.6410 10.2282 9.7235 3.3404 9.4096 9.3932 14.3797 34.5103 15.2899 13.5802 5.7981 63.7969 104.5475 132.3994 0.0418 8.3158 0.8125 14.2255 34.8190 35.8039 13.9303 5.1147 6.5847 4.7143 9.1531 4.2570 8.8008 0.0980 0.2500 2.4822 13.9600 21.4552 14.8827 68.2841 13.9605 75.2966 17.2346 110.8343 172.4948 78.3416 38.9329 1.5536 504.5292 0.0968 2.1669 4.0022 118.2979 14.2172 5.6441 7.8000 2.4042 11.6889 53.7629 7.8096 1.6599 19.5576 87.9615 19.9243 36.2183 21.7827 110.7630 24.8395 21.8811 1.1175 4.2360 12.8989 1.6278 366.3355 116.2261 167.1090 16.4007 86.1664 563.0508 36.7318 49.0240 80.7126 97.0250 137.7075 268.7791 18.2361 22.1792 30.8521 23.0136 14.9464 9.1052 24.1184 12.8564 16.3862 43.2257 54.6016 26.9629 11.0517 38.3842 16.3992 26.1869 12.9414 14.7209 0.4846 28.7065 26.5402 7.4561 178.6722 16.5455
temp: 298.150 k
press: 1.00000 atm
elementType: 8 8 8 8 7 7 6 6 6 6 6 6 6 6 6 6 6 6 6 6 6 6 6 6 1 1 1 1 1 1 1 1 1 1 1 1 1 1 1 1 1 1 1 1 1 1 1 1
symmnumber: 1
zpe: 1032609.7 jmol-1
zpe.correction: 0.393300 hartree
zpe.thermalcorrener: 0.417845 hartree
zpe.thermalcorrenthalpy: 0.418789 hartree
zpe.thermalcorrgfe: 0.337550 hartree
zpe.sumelectzpe: -1108.960879 hartree
zpe.sumelectthermal: -1108.936334 hartree
zpe.sumelectthermalent: -1108.935390 hartree
zpe.sumelectthermalfe: -1109.016629 hartree
dipole: -3.1675 -1.1314 1.9314
dipole: 3.8786
quadrupole: -115.9022 -147.1823 -150.3290
quadrupole: -11.1911 6.3407 9.1617
quadrupole: 21.9023 -9.3778 -12.5245 -11.1911 6.3407 9.1617
hfenergy: -1109.3541789 hartree
pointgroup: C01 [X(C18H24N2O4)]
dipole: -1.2512097 -0.2441737 -0.8386744 debye
polarizability: 327.2116056|4.0067734|156.0402495|-14.5991232|-12.7207633|204.8406496 unknown
InChI: InChI=1S/C18H24N2O4/c1-5-18(11-17(4,12(2)3)24-15(18)22)14(21)20-16(23)19-13-9-7-6-8-10-13/h6-10,12,19-20H,5,11H2,1-4H3
charge 0 multiplicity 1
48 atoms
O  -2.980681 0.444799 -1.380229
O  -1.024171 -0.557137 -2.102537
O  -0.706868 0.00709 2.183644
O  2.232741 -0.373805 1.944202
N  0.564671 -0.485545 0.256452
N  2.748575 0.07536 -0.317407
C  -3.724656 0.644176 -0.04144
C  -1.852859 -0.97141 0.214782
C  -3.191451 -0.5233 0.842763
C  -5.233912 0.519238 -0.384069
C  -1.882207 -0.367267 -1.203073
C  -1.705229 -2.530147 0.111106
C  -3.290357 2.025943 0.470887
C  -0.613683 -0.415799 1.006525
C  -5.702281 1.555421 -1.431944
C  -6.107038 0.594203 0.893844
C  -1.592966 -3.225429 1.48273
C  1.896782 -0.25644 0.741389
C  4.163763 0.243508 -0.276338
C  4.81367 0.546461 -1.503638
C  4.92749 0.12208 0.914974
C  6.210988 0.723726 -1.542725
C  6.326975 0.298476 0.856161
C  6.97903 0.598841 -0.36142
H  -3.040257 -0.201552 1.886083
H  -3.907063 -1.364504 0.830785
H  -5.358321 -0.491494 -0.826894
H  -0.820986 -2.767567 -0.509398
H  -2.587932 -2.91413 -0.436772
H  -3.858449 2.292002 1.379432
H  -3.461849 2.80154 -0.293137
H  -2.220182 2.029266 0.740924
H  -5.056991 1.537809 -2.326467
H  -6.737691 1.330941 -1.746705
H  -5.698246 2.5804 -1.017465
H  -5.794691 -0.13567 1.662398
H  -7.160605 0.382126 0.638216
H  -6.072829 1.602629 1.345177
H  -1.548317 -4.321025 1.349313
H  -2.461942 -2.99778 2.126105
H  -0.684876 -2.911238 2.026748
H  0.429551 -0.715944 -0.742991
H  2.314919 0.254594 -1.226951
H  4.225984 0.640343 -2.426439
H  4.424227 -0.098303 1.857756
H  6.698231 0.957358 -2.495686
H  6.910703 0.203042 1.778584
H  8.065089 0.735516 -0.390755
