program: Gaussian 09
title: 000206842
version: EM64L-G09RevD.01
frameworkgroup: C1[X(C17H13N3O3)]
method: RPBEPBE
basis: SDD
operation: Freq
keyword: #p
keyword: freq=noraman
keyword: PBEPBE/SDD
title: #p freq=noraman PBEPBE/SDD
converged: YES YES NO NO
title: Mulliken charges:
elementType: O O O N N N C C C C C C C C C C C C C C C C C H H H H H H H H H H H H H
charge: -0.219663 -0.205949 -0.211087 -0.215047 -0.026954 0.009088 0.121949 -0.535099 -0.393658 0.269317 0.338780 -0.579790 0.139888 -0.023767 -0.563885 0.416659 -0.584730 0.322656 -0.368518 -0.374019 -0.230767 -0.229092 -0.234956 0.254916 0.250760 0.267374 0.255378 0.304004 0.326121 0.230948 0.272551 0.249433 0.269537 0.232305 0.231550 0.233766
chargesum: 0.00000
title: Mulliken charges with hydrogens summed into heavy atoms:
elementType: O O O N N N C C C C C C C C C C C C C C C C C
charge: -0.219663 -0.205949 -0.211087 -0.215047 -0.026954 0.009088 0.121949 -0.029423 0.129095 0.269317 0.338780 -0.275786 0.139888 -0.023767 -0.237763 0.416659 -0.081231 0.322656 -0.119085 -0.104482 0.001538 0.002458 -0.001190
polarizability: 2.81399493e+02 -1.57328465e+01 2.86834125e+02 1.19740901e+01 1.74437418e+01 1.31918515e+02
1716.lowfreq: -0.0009 -0.0002 0.0004 1.7564 4.5428 8.6116 39.3320 53.7639 57.2058
frequency: 39.3275 53.7626 57.1926 67.0371 73.5707 109.3691 126.3487 161.8704 169.3239 191.2996 239.9452 248.5201 265.1940 295.1594 315.0593 324.8707 360.0419 398.1578 407.1761 419.6238 445.7736 461.2363 520.8998 530.3810 541.4097 558.5606 594.7810 612.8806 619.3326 640.6456 663.9690 682.0438 700.0920 709.7237 713.5622 741.4180 763.2760 791.0907 828.1516 833.8084 857.7594 907.5713 929.0083 935.7414 939.1054 953.0561 971.2772 983.5300 985.6430 989.7941 993.8209 1002.3046 1021.5567 1040.7233 1056.7979 1061.6588 1083.0800 1088.8177 1162.7833 1174.5667 1181.9943 1190.7857 1195.5429 1200.4025 1218.9363 1232.5954 1261.4370 1280.7535 1295.3416 1302.4273 1319.2912 1330.4992 1356.0077 1360.9532 1381.9581 1411.1039 1434.2292 1443.7118 1453.2812 1463.2344 1464.2732 1481.2498 1496.7808 1549.6174 1584.8335 1595.4103 1605.6213 1609.8611 1623.1533 2932.9203 3004.2197 3022.3679 3076.1690 3105.3361 3108.7141 3129.3524 3138.1047 3149.9534 3161.8549 3172.2267 3177.9205 3179.1896
redmass: 5.8148 9.4764 4.2610 7.8386 6.0570 3.1338 4.6022 6.8135 4.0994 3.8505 3.8041 4.9867 5.1736 6.6808 6.8584 5.4371 5.8774 6.4249 2.9286 5.1696 5.0641 5.0786 4.4860 5.3215 4.2430 4.4112 5.1226 6.3007 6.4389 4.2419 6.5437 5.6523 2.1940 3.4370 6.4459 4.6442 2.9393 2.9652 5.5547 1.9062 1.2477 5.1381 1.3797 2.2319 2.0836 1.4932 4.5229 3.0506 1.4342 5.1655 2.9544 1.3333 3.6993 2.6750 1.8166 3.1801 1.8176 1.6880 1.6316 1.0562 1.5383 1.1636 1.3052 3.8592 1.6237 1.7792 2.5791 1.7197 2.4711 2.8234 1.4021 1.3129 2.4709 6.5697 8.2678 5.0523 2.2562 4.6343 2.9260 1.1766 1.2127 2.3457 1.1480 7.9323 6.3369 8.8054 8.3664 6.3717 9.1600 1.0690 1.0652 1.0661 1.0973 1.0925 1.1017 1.0850 1.0883 1.0932 1.0964 1.1001 1.0925 1.0924
irintensity: 2.9366 0.0665 0.9043 3.2659 0.1855 1.9954 2.9058 3.3191 0.9633 0.3562 3.5516 4.3158 2.7504 2.9171 2.4549 2.4328 10.8133 2.6826 0.3191 0.5266 5.6703 1.4722 3.4504 2.7491 2.2368 3.8588 12.6300 1.6694 1.3500 5.8857 22.1732 9.3325 43.1739 12.5035 7.4199 34.9907 32.8707 12.7165 7.6888 0.2563 3.9252 15.9967 15.0747 3.5248 2.3288 17.8048 6.8855 0.2511 3.2654 2.0959 13.2421 0.0601 15.2606 1.9535 2.5842 5.5431 53.4487 7.2400 41.7894 0.2505 11.9734 36.1671 57.1071 402.6295 85.8608 53.6682 50.6782 14.8122 158.4114 67.9600 13.1618 4.1827 12.0480 127.5131 0.6327 49.1993 12.3327 59.4741 27.2006 5.8229 29.2531 1.6805 33.4948 33.3905 0.8229 40.4217 346.3030 18.7339 174.7668 35.6275 17.6110 25.6188 10.5272 12.2045 8.8525 1.1125 4.4905 28.1156 17.6235 17.4477 2.1176 4.9926
temp: 298.150 k
press: 1.00000 atm
elementType: 8 8 8 7 7 7 6 6 6 6 6 6 6 6 6 6 6 6 6 6 6 6 6 1 1 1 1 1 1 1 1 1 1 1 1 1
symmnumber: 1
zpe: 706383.5 jmol-1
zpe.correction: 0.269047 hartree
zpe.thermalcorrener: 0.287018 hartree
zpe.thermalcorrenthalpy: 0.287963 hartree
zpe.thermalcorrgfe: 0.222405 hartree
zpe.sumelectzpe: -1043.868256 hartree
zpe.sumelectthermal: -1043.850284 hartree
zpe.sumelectthermalent: -1043.849340 hartree
zpe.sumelectthermalfe: -1043.914898 hartree
dipole: 1.6982 -1.0202 1.4563
dipole: 2.4588
quadrupole: -108.2014 -177.4791 -125.7448
quadrupole: 2.6745 2.0126 9.0910
quadrupole: 28.9404 -40.3373 11.3969 2.6745 2.0126 9.0910
hfenergy: -1044.1373029 hartree
pointgroup: C01 [X(C17H13N3O3)]
dipole: -0.6477912 0.4357511 0.5711949 debye
polarizability: 279.8845258|-15.450684|288.2021349|-12.7555554|-17.4984641|132.0654729 unknown
InChI: InChI=1S/C17H13N3O3/c21-15-10-18-16(11-4-2-1-3-5-11)14-9-13(20(22)23)8-12-6-7-19(15)17(12)14/h1-5,8-9H,6-7,10H2
charge 0 multiplicity 1
36 atoms
O  -2.100284 4.042576 -0.095084
O  0.261313 -4.092712 -0.9420
O  -1.862215 -4.52467 -0.222704
N  -1.977815 1.760292 0.335872
N  0.806063 2.223423 -0.856499
N  -0.889521 -3.714091 -0.491081
C  -1.531252 0.446472 0.09105
C  -3.800784 0.285947 0.883498
C  -3.256359 1.727385 1.119318
C  -2.575993 -0.478096 0.396449
C  -0.229478 0.020326 -0.305493
C  -2.382282 -1.845631 0.212177
C  -1.562273 2.930258 -0.333004
C  0.913393 0.982401 -0.419912
C  -0.05223 -1.376062 -0.497135
C  -1.11247 -2.271095 -0.263854
C  -0.483134 2.700199 -1.403967
C  2.277971 0.540581 0.014723
C  2.469943 -0.413584 1.050948
C  3.41869 1.129668 -0.595704
C  3.772228 -0.776028 1.458924
C  4.717433 0.762426 -0.191661
C  4.899874 -0.194215 0.836371
H  -4.594879 0.279203 0.11335
H  -4.228804 -0.14475 1.803741
H  -3.918291 2.530867 0.76232
H  -3.032435 1.91152 2.185137
H  -3.158834 -2.588349 0.412198
H  0.912452 -1.774375 -0.821787
H  -0.899611 1.986735 -2.150794
H  -0.314521 3.671305 -1.891779
H  1.606173 -0.856355 1.55832
H  3.25953 1.877908 -1.378022
H  3.905435 -1.507681 2.263153
H  5.587918 1.217642 -0.676582
H  5.910048 -0.481243 1.148814
