program: Gaussian 09
title: 000206838
version: EM64L-G09RevD.01
frameworkgroup: C1[X(C10H7BrN2O2)]
method: RPBEPBE
basis: SDD
operation: Freq
keyword: #p
keyword: freq=noraman
keyword: PBEPBE/SDD
title: #p freq=noraman PBEPBE/SDD
converged: NO YES NO NO
title: Mulliken charges:
elementType: Br O O N N C C C C C C C C C C H H H H H H H
charge: 0.007711 -0.238342 -0.210368 -0.463488 -0.412569 0.312129 0.476655 -0.346591 0.133018 0.158435 -0.332113 -0.379990 -0.224379 -0.232101 -0.205382 0.207676 0.336257 0.357795 0.243341 0.317109 0.239553 0.255644
chargesum: 0.00000
title: Mulliken charges with hydrogens summed into heavy atoms:
elementType: Br O O N N C C C C C C C C C C
charge: 0.007711 -0.238342 -0.210368 -0.127231 -0.054774 0.312129 0.476655 -0.138915 0.133018 0.158435 -0.088772 -0.062881 -0.224379 0.007452 0.050262
polarizability: 3.16584293e+02 1.57178787e+01 1.45750385e+02 2.72260665e-02 -1.83895632e-02 5.29274720e+01
1716.lowfreq: -0.0009 -0.0008 -0.0006 4.0430 4.8715 7.1128 38.8296 57.7550 91.1446
frequency: 38.8159 57.7542 91.1420 144.3938 159.5513 175.5679 185.4721 227.8657 285.0681 310.4979 343.1922 391.7957 416.9965 442.6835 532.0596 537.9923 560.2152 601.8730 626.3419 646.0178 654.2443 695.8726 711.6966 741.4843 759.5270 761.7330 805.0613 870.5291 881.0734 923.3709 942.2787 977.7063 982.2267 1017.8813 1073.3925 1096.8742 1124.3728 1195.7751 1209.0536 1231.1919 1297.7274 1309.6082 1312.6472 1333.1330 1370.7426 1407.1804 1441.2040 1466.9077 1550.4945 1593.0243 1632.0250 1662.8991 1712.6945 3073.5472 3142.8463 3146.5264 3158.7553 3175.2185 3600.2084 3601.1602
redmass: 6.9504 7.0234 10.2398 5.7577 12.6218 8.7458 5.4651 9.1572 6.5350 3.6660 9.2204 8.6866 3.7705 3.6963 1.2946 5.4836 3.2175 7.3679 10.6136 1.1269 7.5437 2.2724 9.4421 6.5916 5.1166 9.1432 1.3694 1.4035 5.2203 1.4952 1.4259 5.4120 3.4586 1.3236 2.3591 1.9541 3.0943 1.1989 2.2310 2.0453 4.8254 1.7578 1.7862 1.7991 4.3777 2.4942 1.8123 2.3989 5.6107 6.2737 7.9986 7.8270 8.2839 1.0866 1.0884 1.0920 1.0953 1.0978 1.0788 1.0825
irintensity: 1.4408 0.2253 1.2696 0.7625 0.8849 2.3924 1.2039 0.6256 1.6696 0.3080 8.9551 22.8830 2.4116 2.5651 60.2471 3.2079 7.2431 9.5395 51.2169 164.8517 41.5207 32.3193 35.5012 14.2835 19.9962 37.4416 37.6553 0.0575 69.0865 31.2665 14.6669 25.4663 30.5365 3.2387 25.7178 16.1178 10.9486 7.8005 170.1894 11.5030 351.5356 43.7476 31.2214 122.0766 3.3262 8.1636 16.7136 31.3075 78.9513 26.5536 127.5702 89.4294 881.9623 21.1365 12.4848 4.0002 23.9342 9.6188 110.6878 55.1613
temp: 298.150 k
press: 1.00000 atm
elementType: 35 8 8 7 7 6 6 6 6 6 6 6 6 6 6 1 1 1 1 1 1 1
symmnumber: 1
zpe: 403256.3 jmol-1
zpe.correction: 0.153592 hartree
zpe.thermalcorrener: 0.166201 hartree
zpe.thermalcorrenthalpy: 0.167145 hartree
zpe.thermalcorrgfe: 0.112686 hartree
zpe.sumelectzpe: -657.660052 hartree
zpe.sumelectthermal: -657.647443 hartree
zpe.sumelectthermalent: -657.646499 hartree
zpe.sumelectthermalfe: -657.700958 hartree
dipole: 0.8623 -0.4470 0.0044
dipole: 0.9713
quadrupole: -114.4340 -89.8615 -99.0563
quadrupole: -2.4635 -0.0086 0.0141
quadrupole: -13.3167 11.2557 2.0610 -2.4635 -0.0086 0.0141
hfenergy: -657.8136439 hartree
pointgroup: C01[X(C10H7Br1N2O2)]
dipole: 0.2896947 0.1104381 0.2234246 debye
dipolederiv: -0.5183882 -0.1317245 -0.2787989 -0.1916523 -0.1026187 -0.1289665 -0.3937511 -0.1253959 -0.3030931 -0.5439484 0.1062816 0.1914776 -0.0861 -0.4701317 -0.2690413 -0.175136 -0.2568263 -0.8320203 -1.8221865 0.089495 0.0944568 0.2192687 -0.4079606 -0.0681269 0.3359862 -0.0745047 -0.4910059 -1.8335596 -0.0545939 -0.1850225 0.050582 -0.381075 -0.0420205 0.0159771 -0.0471391 -0.4439797 -1.271304 0.2099599 0.3506131 0.188855 -0.4609098 -0.1605649 0.3131797 -0.160528 -0.6594785 0.4654913 -0.1824333 -0.3250827 -0.6520296 0.0064617 -0.1215112 -1.2229445 -0.0956479 -0.1981081 -0.013102 -0.0206549 -0.0421156 0.0751491 0.0439373 0.012806 0.1402896 0.0072868 0.0614281 0.402752 0.0804985 0.1832483 -0.1520805 -0.0762907 0.1026452 -0.2568677 0.1158407 0.0729031 1.7723725 -0.1695513 -0.2405739 0.3371087 0.4430004 0.3608653 0.7237747 0.331751 0.9355428 2.5731541 -0.0953908 -0.0635285 -0.0825602 0.5364324 0.4187055 -0.0328714 0.4177146 1.110398 -0.2873099 -0.0844364 -0.1707203 -0.0607745 -0.1107934 0.0161016 -0.1263512 0.014789 -0.1007415 -0.1749509 0.0160783 0.0280058 -0.0590037 -0.1290228 -0.0095143 -0.1162457 -0.0055733 -0.1431441 0.8768356 0.2806881 0.5926488 0.442401 0.0298822 0.28932 0.9032986 0.2802666 0.4786255 -0.0035672 -0.0082134 -0.008309 -0.0920055 -0.0752717 0.110125 -0.1688359 0.1149072 0.0752465 -0.3150777 -0.1043333 -0.2118697 -0.0809894 -0.1163643 -0.0438226 -0.1681586 -0.0451167 -0.191702 0.0520765 0.0013044 -0.0025842 0.0406781 0.0907792 -0.0990017 0.0717667 -0.1014331 -0.0462197 0.1206887 -0.0123025 -0.0363639 -0.0330504 0.3289076 -0.0684647 -0.075702 -0.0676707 0.2294531 0.2280543 0.0269367 0.0438472 0.0551269 0.3387529 -0.0636693 0.0973773 -0.0651356 0.2543219 0.0920308 0.0321813 0.0576459 0.022099 0.1140686 -0.0808121 0.0381286 -0.080277 0.0060408 0.2041843 -0.0142512 -0.0248077 0.0089142 0.1458591 -0.0278039 0.0192808 -0.0290696 0.1062128 0.0357604 0.0098311 0.0120482 0.0296236 0.1040042 -0.1013453 0.050137 -0.1024795 -0.0354344 -0.0400061 0.0246306 0.035785 0.0204399 0.1483532 -0.0259033 0.0276677 -0.0257584 0.1147548 unknown
polarizability: 314.4158264|5.2580446|72.950158|24.5174833|38.5372377|127.8961649 unknown
InChI: InChI=1S/C10H7BrN2O2/c11-7-3-1-2-6(4-7)5-8-9(14)13-10(15)12-8/h1-5,12-13H
charge 0 multiplicity 1
22 atoms
Br 4.942554 0.714407 2.083562
O  -1.3106 -1.204541 -1.927884
O  -5.037779 0.221821 0.588733
N  -2.681039 0.35289 0.963805
N  -3.367259 -0.614467 -0.918061
C  -1.48876 -0.032815 0.293553
C  1.12132 -0.076173 0.355559
C  -0.237495 0.208378 0.820919
C  -1.961444 -0.68681 -0.981066
C  -3.84698 0.015291 0.261112
C  2.17954 0.347385 1.222768
C  1.465051 -0.727011 -0.868704
C  3.517222 0.120423 0.866198
C  2.817681 -0.939262 -1.198983
C  3.863804 -0.521401 -0.341054
H  -0.260321 0.719512 1.797039
H  -2.72356 0.824417 1.865783
H  -3.988287 -0.974927 -1.641957
H  1.943133 0.849664 2.167069
H  0.671791 -1.057998 -1.544381
H  3.070936 -1.438402 -2.1403
H  4.911389 -0.69028 -0.605608
