program: Gaussian 09
title: 000206828
version: EM64L-G09RevD.01
frameworkgroup: C1[X(C12H14N2)]
method: RPBEPBE
basis: SDD
operation: Freq
keyword: #pfreq=noraman
keyword: PBEPBE/SDD
title: #p freq=noraman PBEPBE/SDD
converged: YES YES NO NO
title: Mulliken charges:
elementType: N N C C C C C C C C C C C C H H H H H H H H H H H H H H
charge: -0.179786 -0.085066 0.050854 -0.338188 -0.379431 0.455248 -0.494879 0.305959 -0.210674 -0.441408 -0.439535 -0.630838 -0.443826 -0.247895 0.235347 0.192778 0.202447 0.208016 0.225444 0.196000 0.244330 0.251856 0.218237 0.191529 0.230166 0.225550 0.238794 0.218971
chargesum: 0.00000
title: Mulliken charges with hydrogens summed into heavy atoms:
elementType: N N C C C C C C C C C C C C
charge: -0.179786 -0.085066 0.050854 0.089937 0.031032 0.455248 -0.073434 0.305959 0.033656 -0.189552 -0.221298 0.016407 -0.205032 -0.028924
polarizability: 1.70770844e+02 -3.66853381e+00 1.69622254e+02 -1.44916055e+00 7.91604600e-02 7.54281706e+01
1716.lowfreq: -2.7892 -0.0005 0.0004 0.0005 4.7291 12.3299 67.2915 88.3799 181.5045
frequency: 67.2850 88.3271 181.5032 216.6924 219.2520 224.9606 274.1597 293.0591 332.9902 350.0200 396.5270 462.0655 491.0119 511.3490 540.2271 569.4841 592.2969 606.3587 668.5435 703.1676 731.5943 752.0137 780.6346 797.0300 847.0691 854.8354 886.9651 926.5353 957.0516 964.2641 972.6528 1018.2974 1049.6826 1051.9995 1066.6981 1084.7011 1106.0285 1115.6498 1143.6653 1175.2142 1189.7320 1203.6445 1234.2385 1246.3912 1262.2407 1302.6524 1319.4679 1339.0545 1349.7526 1360.4581 1374.2544 1382.7737 1407.7080 1430.8660 1442.0607 1450.3973 1462.8629 1467.0055 1469.9230 1482.2270 1488.4570 1527.9346 1596.4625 1616.4602 2794.0322 2858.9026 2879.6999 2974.7367 3024.1216 3029.1302 3038.6111 3041.9015 3082.1303 3111.6091 3131.9401 3156.1639 3201.7929 3229.3224
redmass: 3.0594 2.7922 3.2841 3.6967 1.2463 2.2796 3.6976 3.3962 4.1805 2.2371 2.7045 2.7913 3.5585 3.1405 3.4309 3.6386 4.3393 3.6293 4.3705 4.6094 1.5702 1.4474 3.1422 2.2438 4.3594 1.3688 1.4587 2.2108 1.6306 1.8727 1.9446 3.0144 2.0935 2.4348 1.7564 2.0376 1.5763 1.5648 2.1670 1.4266 1.5241 1.5967 1.4802 1.8067 1.8825 1.4658 2.0542 1.6677 2.0479 2.0231 1.8128 1.3996 2.9511 1.2629 1.8819 1.0784 1.7002 1.0596 1.1772 1.0567 2.3269 4.5567 6.8278 7.6192 1.0705 1.0581 1.0682 1.0601 1.0735 1.0857 1.0984 1.0931 1.1009 1.0875 1.0894 1.0991 1.0900 1.1067
irintensity: 0.8825 1.0101 0.9913 6.5204 0.1398 6.2726 0.9973 0.3503 1.7614 5.6122 2.8860 2.0915 2.4317 1.9255 0.7229 2.3256 2.3816 0.6589 4.0705 2.7447 59.7265 14.2522 35.2176 44.9233 3.2947 4.4889 3.2755 12.6213 2.4586 1.6640 10.0614 8.0449 32.9788 6.5576 1.5413 4.7607 1.7261 19.9163 47.5260 14.9985 22.8484 2.5815 2.1257 10.4017 15.7637 5.4677 19.9452 44.0982 11.7083 3.5004 9.9673 18.7960 24.5873 2.4391 16.2870 0.9278 22.3205 22.6206 16.5427 10.5329 11.3618 10.9872 3.9954 1.7894 74.1475 115.4395 123.9646 52.4657 38.3889 21.9855 39.9705 33.5515 33.4817 10.7927 14.9520 36.5504 0.7062 6.4627
temp: 298.150 k
press: 1.00000 atm
elementType: 7 7 6 6 6 6 6 6 6 6 6 6 6 6 1 1 1 1 1 1 1 1 1 1 1 1 1 1
symmnumber: 1
zpe: 616274.1 jmol-1
zpe.correction: 0.234726 hartree
zpe.thermalcorrener: 0.246025 hartree
zpe.thermalcorrenthalpy: 0.246969 hartree
zpe.thermalcorrgfe: 0.197970 hartree
zpe.sumelectzpe: -574.147210 hartree
zpe.sumelectthermal: -574.135911 hartree
zpe.sumelectthermalent: -574.134967 hartree
zpe.sumelectthermalfe: -574.183966 hartree
dipole: -2.7700 1.1502 0.7017
dipole: 3.0803
quadrupole: -74.2345 -73.0002 -89.2736
quadrupole: -0.6575 -1.5064 -0.3818
quadrupole: 4.6016 5.8359 -10.4375 -0.6575 -1.5064 -0.3818
hfenergy: -574.3819361 hartree
pointgroup: C01 [X(C12H14N2)]
dipole: -1.0964084 -0.4250239 -0.2930346 debye
polarizability: 170.8880339|3.5973522|169.4351452|2.2310613|2.0175213|75.4980891 unknown
InChI: InChI=1S/C12H14N2/c1-13-7-8-14-6-5-10-3-2-4-11(9-13)12(10)14/h2-6H,7-9H2,1H3
charge 0 multiplicity 1
28 atoms
N  0.043679 -1.472458 -0.090543
N  -2.503304 0.341711 0.2344
C  0.572539 -0.167053 -0.034792
C  -1.348894 -1.885628 0.150689
C  -2.4079 -0.961255 -0.467344
C  -0.067175 1.102155 -0.050834
C  -1.550706 1.349151 -0.295288
C  2.013084 -0.294885 0.014649
C  1.111787 -2.386274 -0.067273
C  2.323322 -1.706857 -0.015145
C  0.782872 2.229303 0.038365
C  -3.883537 0.878298 0.246132
C  2.827319 0.865003 0.077656
C  2.200734 2.122693 0.104322
H  -1.541294 -1.929127 1.241358
H  -1.466523 -2.903962 -0.266826
H  -2.214137 -0.834464 -1.561716
H  -3.379197 -1.479501 -0.364101
H  -1.810491 2.323279 0.15725
H  -1.702199 1.46816 -1.404214
H  0.912725 -3.45748 -0.087312
H  3.314448 -2.157104 -0.004967
H  0.327579 3.227937 0.040563
H  -4.273675 1.140133 -0.769936
H  -3.918663 1.789783 0.86878
H  -4.56693 0.136766 0.695852
H  3.918837 0.776915 0.110087
H  2.802204 3.036261 0.168686
