program: Gaussian 09
title: 000206813
version: EM64L-G09RevD.01
frameworkgroup: C1[X(C17H14N2)]
method: RPBEPBE
basis: SDD
operation: Freq
keyword: #pfreq=noraman
keyword: PBEPBE/SDD
title: #p freq=noraman PBEPBE/SDD
converged: NO YES NO NO
title: Mulliken charges:
elementType: N N C C C C C C C C C C C C C C C C C H H H H H H H H H H H H H H
charge: -0.171292 -0.032751 0.103367 -0.395179 0.275141 0.278531 -0.502704 -0.034266 -0.224925 -0.427008 -0.387610 -0.432395 0.321579 -0.258200 -0.384342 -0.385938 -0.234876 -0.233024 -0.240826 0.211058 0.251043 0.230991 0.224214 0.250906 0.256461 0.263684 0.244523 0.225835 0.262723 0.264967 0.226793 0.225628 0.227891
chargesum: 0.00000
title: Mulliken charges with hydrogens summed into heavy atoms:
elementType: N N C C C C C C C C C C C C C C C C C
charge: -0.171292 -0.032751 0.103367 0.066922 0.275141 0.278531 -0.047499 -0.034266 0.025980 -0.170547 -0.123926 -0.187872 0.321579 -0.032364 -0.121619 -0.120970 -0.008083 -0.007396 -0.012935
polarizability: 2.74278326e+02 5.86883521e+00 2.09616992e+02 -1.12557045e+01 4.13413340e+00 1.11062865e+02
1716.lowfreq: -0.0007 -0.0004 -0.0003 3.9290 6.5586 10.8985 43.8626 66.6112 81.6655
frequency: 43.8532 66.6080 81.6637 128.1794 145.4349 212.8424 231.5273 247.3322 267.7770 280.0920 344.8450 373.6605 408.8547 411.7835 461.4218 471.3671 523.0573 532.4820 574.2838 584.7127 604.7381 616.7682 625.9191 655.2914 695.6456 696.6778 704.4684 735.4376 758.3919 778.1215 802.6927 817.2202 855.9630 858.8198 871.8918 888.4403 919.9636 936.9118 945.2333 974.0305 985.1300 989.5617 997.6678 1001.4593 1026.1123 1046.9653 1052.9801 1068.3712 1070.1744 1087.1191 1110.9439 1166.0973 1171.5556 1175.9096 1188.8409 1211.6902 1236.6220 1242.9446 1280.7930 1315.3072 1316.3541 1321.3127 1344.0931 1356.1009 1366.8847 1380.3391 1408.2839 1432.6382 1441.8263 1464.1746 1468.3229 1479.6597 1489.4158 1517.4440 1552.4383 1582.1607 1588.6504 1608.0892 1610.4814 2956.4366 2994.9559 3046.7654 3057.1568 3124.0019 3131.4979 3134.5901 3148.0964 3149.6392 3159.1595 3166.3474 3169.2898 3209.3261 3235.5470
redmass: 4.4952 4.2462 4.5369 3.5886 4.1500 4.4573 3.8442 5.2920 3.9836 3.5477 3.4580 4.6755 3.0734 4.2537 4.9391 4.3199 3.9734 3.9197 3.6378 3.6700 4.0168 6.0599 5.0523 5.5809 4.6365 4.2137 1.6369 1.5098 1.6752 2.1285 3.8292 2.4673 1.3503 1.2796 3.1572 4.1298 1.4259 1.5068 2.3482 1.3372 1.3721 5.9353 1.3703 3.1230 2.4319 2.0760 2.3699 2.2218 1.9351 1.7495 1.9142 1.4403 1.0550 1.3260 1.1182 1.5772 1.6241 1.5863 2.6188 1.8128 1.4640 1.7258 1.6383 2.7656 2.1316 8.0243 3.0490 2.2503 3.3767 1.3887 1.3932 2.2794 1.8130 4.5746 6.5416 6.4844 6.5238 6.8588 6.6059 1.0668 1.0600 1.0977 1.1019 1.0847 1.0862 1.0885 1.0930 1.0926 1.0963 1.0976 1.0996 1.0903 1.1071
irintensity: 0.1460 0.2971 1.1015 3.1805 0.8862 2.1491 1.3561 2.0808 2.4824 5.0178 3.4037 0.2822 0.4462 2.2786 4.0246 2.6438 4.2141 4.8458 0.2923 5.0637 1.3422 0.0114 1.0012 19.3204 1.7419 4.7519 57.7981 97.7558 12.0989 19.4619 19.7878 42.7514 4.3396 3.2047 1.2991 10.9526 1.7683 1.6970 3.9259 1.4787 2.2473 0.1941 0.7707 5.0354 10.4224 2.9379 9.0108 9.2467 31.3522 9.3163 2.5699 3.6326 0.1276 28.8902 8.1157 7.9738 0.8267 13.8853 126.3359 0.9585 7.4070 36.3149 11.9445 11.8486 29.0257 0.9433 12.3817 10.6660 3.7345 3.1986 8.2206 6.2131 23.5601 36.8171 83.1395 6.8883 7.3011 3.9119 3.8525 49.1769 46.1633 40.5153 40.4987 0.4901 2.4677 9.4830 45.7574 8.1742 19.6563 18.1378 18.7159 0.3808 4.7419
temp: 298.150 k
press: 1.00000 atm
elementType: 7 7 6 6 6 6 6 6 6 6 6 6 6 6 6 6 6 6 6 1 1 1 1 1 1 1 1 1 1 1 1 1 1
symmnumber: 1
zpe: 693667.4 jmol-1
zpe.correction: 0.264204 hartree
zpe.thermalcorrener: 0.278185 hartree
zpe.thermalcorrenthalpy: 0.279129 hartree
zpe.thermalcorrgfe: 0.223345 hartree
zpe.sumelectzpe: -764.406978 hartree
zpe.sumelectthermal: -764.392997 hartree
zpe.sumelectthermalent: -764.392053 hartree
zpe.sumelectthermalfe: -764.447837 hartree
dipole: -1.5565 -0.3628 0.3019
dipole: 1.6265
quadrupole: -96.6404 -100.6550 -112.5652
quadrupole: 7.9046 -2.0110 0.7994
quadrupole: 6.6465 2.6319 -9.2784 7.9046 -2.0110 0.7994
hfenergy: -764.6711821 hartree
pointgroup: C01 [X(C17H14N2)]
dipole: -0.607551 0.1800617 -0.0890307 debye
polarizability: 273.3446612|-10.8648757|199.1185811|13.792047|30.5960598|122.4949402 unknown
InChI: InChI=1S/C17H14N2/c1-2-5-13(6-3-1)16-15-8-4-7-14-9-11-19(17(14)15)12-10-18-16/h1-9,11H,10,12H2
charge 0 multiplicity 1
33 atoms
N  -2.405814 1.198071 -0.21706
N  0.488303 1.770767 1.01011
C  -1.795597 -0.059482 -0.131237
C  -1.788381 2.472809 0.180682
C  -0.448791 -0.418059 0.185495
C  -2.803848 -1.04395 -0.456193
C  -0.845737 2.270706 1.397114
C  0.637954 0.57157 0.47599
C  -3.752942 1.025302 -0.579313
C  -4.027434 -0.328447 -0.743357
C  -0.176472 -1.814079 0.218667
C  -2.474971 -2.421138 -0.419445
C  2.057596 0.200157 0.140385
C  -1.163955 -2.793605 -0.063468
C  2.382986 -0.559522 -1.015566
C  3.113116 0.679071 0.961977
C  3.730325 -0.838411 -1.335759
C  4.456968 0.390515 0.648684
C  4.772133 -0.371294 -0.502341
H  -2.599147 3.178883 0.43599
H  -1.203992 2.907057 -0.652806
H  -0.695196 3.249378 1.886357
H  -1.352898 1.599215 2.123298
H  -4.406974 1.889681 -0.685121
H  -4.986102 -0.760376 -1.023707
H  0.833794 -2.141855 0.481752
H  -3.229512 -3.179329 -0.655923
H  -0.892079 -3.853119 -0.008421
H  1.584297 -0.915481 -1.674754
H  2.852633 1.28525 1.834993
H  3.965431 -1.416567 -2.236462
H  5.259103 0.758925 1.298125
H  5.816702 -0.594043 -0.747787
