program: Gaussian 09
title: 000206805
version: EM64L-G09RevD.01
frameworkgroup: C1[X(C12H11N2S)]
method: RPBEPBE
basis: SDD
operation: Freq
keyword: #p
keyword: freq=noraman
keyword: PBEPBE/SDD
title: #p freq=noraman PBEPBE/SDD
converged: YES YES YES YES
title: Mulliken charges:
elementType: S N N C C C C C C C C C C C C H H H H H H H H H H H
charge: 0.474136 -0.243230 0.111498 0.616779 0.456319 -0.311692 -0.402594 -0.403797 0.214825 -0.243962 -0.772391 -0.257946 -0.232114 -0.209999 -0.759601 0.274096 0.267604 0.268926 0.268586 0.268928 0.276829 0.263276 0.271722 0.261883 0.261879 0.280042
chargesum: 1.00000
title: Mulliken charges with hydrogens summed into heavy atoms:
elementType: S N N C C C C C C C C C C C C
charge: 0.474136 -0.243230 0.111498 0.616779 0.456319 -0.311692 -0.402594 -0.129701 0.214825 0.023642 0.034049 0.018883 0.031162 0.061722 0.044203
polarizability: 2.62229566e+02 -1.87214548e+00 1.64924096e+02 -1.17091827e-03 4.37246798e-03 6.58996247e+01
1716.lowfreq: -39.1256 -4.4831 0.0014 0.0014 0.0020 5.4220 7.8997 49.3521 95.6214
frequency: -39.1180 49.3471 95.6209 168.7199 204.1010 205.1016 206.9560 296.8363 303.9452 324.5114 349.2627 379.4108 428.5072 439.0231 486.8668 519.7456 523.7517 555.8624 557.9632 581.9760 583.0160 677.0492 723.3733 725.1430 741.7242 769.4017 865.4695 869.9672 894.1225 938.8745 962.7090 981.9801 995.7393 1008.5122 1029.4485 1035.6910 1041.1621 1051.2225 1053.0367 1128.0185 1159.7388 1183.9606 1199.3237 1254.1247 1290.3606 1302.6783 1365.5638 1387.2050 1396.0110 1402.4597 1411.2401 1441.7310 1447.4404 1452.6629 1456.2912 1470.7225 1483.5060 1501.2852 1580.2719 1592.0849 1602.4408 2990.2914 2996.0185 3064.2455 3079.3166 3124.0096 3138.5159 3162.3276 3170.8988 3187.2463 3187.4250 3238.4192
redmass: 1.0215 3.7368 3.7024 3.1691 5.8000 4.0669 6.4821 2.8703 1.1479 3.8894 3.9206 6.0709 10.8685 3.0941 9.3467 3.7296 4.7395 4.5923 4.8282 5.7049 3.5294 6.3308 6.5458 4.0736 3.4403 1.5139 1.3421 5.6471 1.2453 5.8614 1.3620 6.3011 1.6937 1.3548 1.9831 2.3713 1.6420 1.5702 2.6473 4.9150 1.7020 1.6458 1.3008 2.6335 1.5182 3.9691 5.1671 2.4815 1.6806 3.2074 1.2266 2.1479 2.4087 1.0447 1.4735 1.0441 1.2410 3.1758 6.5262 6.2909 6.2412 1.0401 1.0396 1.0957 1.0984 1.0974 1.0985 1.0885 1.0931 1.0998 1.0940 1.0929
irintensity: 1.1219 0.0393 1.5881 0.6620 0.7092 1.1970 2.8047 1.1399 3.3377 0.1871 1.6233 0.6803 3.1190 9.5535 1.1699 0.0762 3.9025 2.2342 0.3891 4.3755 0.1770 13.6931 1.0516 0.8728 17.7407 76.0172 0.4434 2.1711 10.8907 3.7808 0.4639 4.5756 23.9285 0.0137 1.2459 1.1405 9.6599 8.5256 0.6378 28.5168 16.4851 2.2152 3.0553 2.2238 1.9035 12.8901 13.5483 28.4809 89.8768 34.8020 30.1030 67.6666 31.0957 25.5763 65.0551 23.4031 102.0770 72.6635 26.5384 4.3141 236.9084 6.2371 0.4336 1.4172 0.9985 5.1325 4.2435 0.6369 0.4666 1.2256 0.2809 0.6828
temp: 298.150 k
press: 1.00000 atm
elementType: 16 7 7 6 6 6 6 6 6 6 6 6 6 6 6 1 1 1 1 1 1 1 1 1 1 1
symmnumber: 1
zpe: 529186.0 jmol-1
zpe.correction: 0.201556 hartree
zpe.thermalcorrener: 0.213326 hartree
zpe.thermalcorrenthalpy: 0.214270 hartree
zpe.thermalcorrgfe: 0.163703 hartree
zpe.sumelectzpe: -970.172106 hartree
zpe.sumelectthermal: -970.160336 hartree
zpe.sumelectthermalent: -970.159392 hartree
zpe.sumelectthermalfe: -970.209959 hartree
dipole: -0.7134 4.0612 0.0001
dipole: 4.1234
quadrupole: -41.4726 -71.6186 -95.3656
quadrupole: -6.3539 0.0003 0.0007
quadrupole: 28.0130 -2.1330 -25.8800 -6.3539 0.0003 0.0007
hfenergy: -970.3736618 hartree
pointgroup: C01 [X(C12H11N2S1)]
dipole: 0.2783622 -1.5981914 -0.000495 debye
dipolederiv: -0.3492583 0.0764931 -0.0000043 0.2754156 0.0397811 -0.0000282 0.0000219 -0.0000247 0.2017238 -0.1055487 -0.2414158 -0.0001133 0.3332136 -0.6356147 -0.000262 0.0000239 -0.0002294 0.0927966 -1.3129054 0.396573 0.000013 0.2790122 -0.3827922 -0.0000538 -0.0000931 -0.000035 -0.1649741 -0.1448938 0.1524335 0.0000097 0.0458572 -0.0389825 -0.0000476 -0.0000106 -0.0000435 0.0589479 0.4990305 0.358308 0.0001821 -0.1408242 0.5977444 0.00028 0.0000051 0.0002814 0.079894 1.0532057 -0.4381179 -0.0000012 -0.4593273 0.5408812 0.0001229 0.0000459 0.0000713 0.0191661 0.4439774 0.4019994 0.0001289 0.0016951 0.1070084 0.0000645 0.0000365 0.0000831 -0.0854335 -0.4771449 -0.5037699 -0.0002528 -0.3771351 -0.4361745 -0.0001682 -0.0002527 -0.0002107 -0.1089679 1.3812007 0.0347978 0.0001942 0.0541199 0.706291 0.0002242 0.0002994 0.0002578 0.1262372 0.1246988 -0.0843951 -0.0000047 0.1300443 -0.0142107 0.0000081 0.0000633 -0.0000082 -0.1088414 -0.0502101 -0.1626967 -0.0000931 -0.0584164 -0.2249902 -0.0001078 -0.0000168 -0.0000334 0.0152446 -0.1948114 -0.1945792 -0.0000527 -0.2398913 0.0458752 0.0000248 -0.000049 0.0000197 -0.0784418 -0.1834869 0.1759965 0.0000268 0.263682 0.0407545 0.0000106 0.0000359 0.0000237 -0.1171657 0.1715788 -0.0294419 -0.0000008 -0.1181982 0.0700779 0.0000333 0.0000002 0.0000359 -0.0905757 -0.6615816 -0.0725805 -0.0001177 0.1471366 0.0155671 0.0000281 -0.0001048 0.000009 -0.0245482 0.0936584 0.0362757 0.0000117 0.0574856 0.0406127 -0.0000506 0.0000157 -0.0000828 0.1537168 0.1132364 0.0457065 -0.0000084 0.0261366 0.0068691 -0.0000202 -0.0000108 -0.0000035 0.1571064 0.0778326 -0.0316561 -0.0848089 -0.0146759 0.0857488 0.0256461 -0.0755678 0.0200263 0.0278248 -0.0324375 0.1189747 0.0001139 0.0195904 0.0855947 -0.00004 0.0000327 -0.0000759 0.1316885 0.0779036 -0.0318097 0.084747 -0.0147848 0.0858119 -0.0255494 0.0755293 -0.0199749 0.0277015 0.1143477 -0.0124685 -0.0000041 0.0300768 0.0160094 -0.0000335 0.0000004 -0.0000405 0.1682262 0.0462123 -0.0510857 -0.0000065 -0.0598528 0.0201777 -0.0000201 -0.000017 -0.0000211 0.1642793 -0.0145434 0.0195221 0.0000035 0.0074397 0.1005948 -0.0000134 0.0000012 -0.0000114 0.1662757 0.1097205 0.0020836 -0.0271297 -0.0727524 0.0740435 0.0856273 -0.0458088 0.0665019 0.0254805 0.1096891 0.0020836 0.0271618 -0.0727488 0.0741337 -0.0856182 0.0458217 -0.0664694 0.025405 0.1105293 0.0327696 0.0000057 -0.0422985 -0.0208124 -0.000057 -0.0000015 -0.0000457 0.1372333 unknown
polarizability: 262.2239794|-2.0120773|164.9296727|0.0078795|0.0299049|65.8996339 unknown
InChI: InChI=1S/C12H11N2S/c1-8-7-9(2)14-10-5-3-4-6-11(10)15-12(14)13-8/h3-7H,1-2H3
charge 1 multiplicity 1
26 atoms
S  -0.377989 2.310561 0.000994
N  0.318122 -0.280863 0.000277
N  2.162414 1.324437 0.000986
C  -1.124076 -0.29586 0.000272
C  1.228331 -1.355986 -0.000176
C  0.863843 1.029967 0.000748
C  -1.657325 1.027003 0.000578
C  2.59375 -1.044971 0.000081
C  3.067965 0.301317 0.000724
C  -2.015685 -1.398611 0.000115
C  0.761734 -2.783994 -0.000957
C  -3.040952 1.276834 0.000627
C  -3.400772 -1.148693 0.000173
C  -3.915805 0.172133 0.0004
C  4.526552 0.645818 0.001094
H  3.310301 -1.869037 -0.000255
H  -1.673607 -2.430698 -0.000002
H  0.161501 -3.022099 -0.897512
H  1.636949 -3.450095 -0.001654
H  0.162068 -3.023269 0.895673
H  -3.429409 2.299114 0.000853
H  -4.090395 -1.997882 0.000055
H  -4.996961 0.337287 0.000429
H  5.03279 0.220085 0.887874
H  5.033116 0.220661 -0.885774
H  4.662844 1.736343 0.001478
