program: Gaussian 09
title: 000206793
version: EM64L-G09RevD.01
frameworkgroup: C1[X(C17H22N2)]
method: RPBEPBE
basis: SDD
operation: Freq
keyword: #pfreq=noraman
keyword: PBEPBE/SDD
title: #p freq=noraman PBEPBE/SDD
converged: YES YES NO NO
title: Mulliken charges:
elementType: N N C C C C C C C C C C C C C C C C C H H H H H H H H H H H H H H H H H H H H H H
charge: -0.236102 -0.119198 -0.060311 0.177044 -0.470575 0.090385 -0.428835 -0.515674 -0.396935 -0.375944 0.176635 0.204328 -0.304813 -0.632827 -0.373678 -0.708748 0.460331 -0.367723 -0.831524 0.188560 0.198362 0.225729 0.207120 0.207909 0.214228 0.216982 0.209985 0.230989 0.214922 0.190775 0.172370 0.222461 0.236419 0.228476 0.233044 0.209449 0.215846 0.221722 0.221270 0.223879 0.223666
chargesum: 0.00000
title: Mulliken charges with hydrogens summed into heavy atoms:
elementType: N N C C C C C C C C C C C C C C C C C
charge: -0.236102 -0.119198 0.128249 0.177044 -0.046484 0.090385 -0.013806 -0.084463 0.044039 0.029753 0.176635 0.204328 0.090017 -0.396408 -0.145202 -0.050408 0.460331 -0.146001 -0.162709
polarizability: 2.81078836e+02 5.25611317e+00 2.00674119e+02 -7.33706143e+00 1.90622064e+00 1.17521867e+02
1716.lowfreq: -5.9660 -0.0007 -0.0004 -0.0002 7.6257 8.7462 37.2499 56.7628 63.9328
frequency: 37.2235 56.7450 63.8635 84.8417 94.6320 139.5979 152.7757 171.3404 196.8905 213.3231 245.2370 250.3171 283.1255 303.6742 321.2382 331.2983 341.7901 365.3890 426.5485 435.8442 458.4970 472.2929 516.8925 519.8106 571.1572 596.7654 606.2793 620.2711 653.2397 720.4892 733.3937 757.2587 768.2885 797.0349 804.8040 832.9090 852.8416 877.2424 884.9923 896.7299 909.8252 930.4108 939.1022 972.1097 997.9102 1012.2319 1021.6804 1044.8701 1046.0759 1068.0856 1071.2244 1083.5120 1104.0571 1111.2143 1134.3292 1140.5967 1145.4515 1173.1001 1182.2194 1191.5040 1216.0702 1233.8362 1235.6567 1243.7070 1262.6455 1284.1344 1289.5243 1300.6788 1310.4423 1325.5944 1337.9712 1346.0318 1354.7530 1367.3354 1371.4156 1380.2539 1389.5866 1395.5486 1404.3935 1437.3952 1460.2619 1462.4708 1463.5718 1466.0270 1470.3713 1470.7327 1473.4435 1474.4370 1476.5548 1488.1413 1491.1336 1493.4596 1578.7113 1599.9768 1632.8087 2766.6253 2835.7685 2850.5790 2951.2203 2968.0597 2969.7851 2974.9860 2986.7216 2992.9425 3001.2344 3029.0550 3041.9630 3043.5363 3048.1038 3058.6773 3071.1906 3075.9798 3081.4330 3092.0335 3114.7508 3120.2050 3141.1493
redmass: 3.5143 1.1007 1.7560 2.8586 3.1606 3.4019 2.8227 2.3016 3.0321 2.2411 1.5113 2.1033 3.6230 3.0893 3.0545 3.0036 3.1203 3.5328 2.8403 3.7049 3.3938 3.4209 3.0687 3.8195 3.9243 3.4206 3.5711 2.9955 5.9916 3.5551 4.3534 3.8488 2.1380 1.4301 1.2303 2.9127 2.0054 1.7033 1.9716 1.7629 2.9030 1.3352 1.9277 2.1965 1.8544 2.3042 2.2309 2.8160 1.5280 1.8663 2.1125 2.4949 2.1345 2.3400 2.1405 1.3760 1.4467 2.2730 1.9422 1.5043 1.9313 1.3643 1.4348 1.6569 1.4281 1.1741 1.4359 1.3886 1.5409 1.3974 1.7063 1.4939 1.6658 1.3317 2.9717 1.4078 1.2297 1.2432 5.1078 2.8829 1.8171 1.2596 1.2597 1.1500 1.0487 1.2491 1.2715 1.1667 1.1032 1.3837 1.0774 1.7338 6.5424 8.4274 7.4790 1.0784 1.0725 1.0709 1.0627 1.0379 1.0591 1.0672 1.0359 1.0605 1.0920 1.1024 1.0987 1.0977 1.0893 1.1022 1.0885 1.0982 1.0963 1.1003 1.0870 1.0914 1.0966
irintensity: 0.1617 0.6720 0.6331 0.1498 1.6727 0.2975 3.6108 1.8505 1.0002 0.6335 1.0611 1.7150 0.2655 4.0093 0.6508 1.7555 1.5488 2.2468 4.4329 3.8519 1.3655 0.9669 2.6711 1.4786 1.5427 10.3836 4.2636 1.3242 1.1015 4.7335 0.1783 2.5140 8.8838 53.0477 0.3864 4.4838 8.6845 2.1389 3.9305 2.8005 6.3180 0.5800 2.3177 0.4208 9.3722 7.0502 4.1272 0.8166 10.7317 4.9222 2.7854 5.1635 21.5922 26.3873 22.9504 3.9922 9.9880 23.3590 17.0976 3.6395 3.4963 6.7344 4.8428 15.1563 11.5711 28.7693 26.3146 15.0645 13.8504 31.9520 3.4349 22.8863 26.0643 1.5009 18.4378 7.5873 20.4987 5.2203 27.0711 29.8020 10.0024 6.0246 28.7757 11.3717 11.4816 3.9274 21.1631 24.0702 5.3860 1.3692 10.9160 18.3937 3.3317 4.0381 3.3646 63.9275 53.4562 169.3168 46.4635 73.7246 49.8007 23.9885 36.9379 37.4547 47.0457 33.0521 54.6141 27.2360 20.2266 46.0652 35.9700 20.5664 62.3093 35.9830 10.4153 23.4302 23.6603
temp: 298.150 k
press: 1.00000 atm
elementType: 7 7 6 6 6 6 6 6 6 6 6 6 6 6 6 6 6 6 6 1 1 1 1 1 1 1 1 1 1 1 1 1 1 1 1 1 1 1 1 1 1
symmnumber: 1
zpe: 926755.8 jmol-1
zpe.correction: 0.352983 hartree
zpe.thermalcorrener: 0.370150 hartree
zpe.thermalcorrenthalpy: 0.371094 hartree
zpe.thermalcorrgfe: 0.308348 hartree
zpe.sumelectzpe: -769.109724 hartree
zpe.sumelectthermal: -769.092557 hartree
zpe.sumelectthermalent: -769.091613 hartree
zpe.sumelectthermalfe: -769.154359 hartree
dipole: 2.7427 -0.5015 -0.5503
dipole: 2.8419
quadrupole: -105.4654 -103.1388 -118.7724
quadrupole: -1.2146 -2.8402 1.3788
quadrupole: 3.6601 5.9868 -9.6469 -1.2146 -2.8402 1.3788
hfenergy: -769.4627071 hartree
pointgroup: C01 [X(C17H22N2)]
dipole: -1.0745599 0.2185089 -0.2184733 debye
polarizability: 281.2119477|3.7048361|200.5162477|7.7209229|-1.7574797|117.546626 unknown
InChI: InChI=1S/C17H22N2/c1-3-18-9-10-19-15-8-7-12(2)11-14(15)13-5-4-6-16(18)17(13)19/h7-8,11,16H,3-6,9-10H2,1-2H3
charge 0 multiplicity 1
41 atoms
N  -0.076849 0.966627 -0.329784
N  -2.834015 0.534979 0.156849
C  -2.064707 -0.623117 -0.412985
C  -0.591307 -0.337763 -0.294966
C  -2.313217 -1.994243 0.267309
C  0.434732 -1.261963 -0.122084
C  -1.323523 -3.055516 -0.289819
C  0.16498 -2.738857 0.033619
C  -0.937761 2.143583 -0.165239
C  -2.388032 1.777856 -0.535443
C  1.667808 -0.501659 -0.038743
C  1.313682 0.893161 -0.152599
C  -4.306952 0.33794 0.054667
C  3.033865 -0.850746 0.128219
C  2.282658 1.915549 -0.080448
C  -5.118617 1.391866 0.83062
C  4.019386 0.158583 0.193447
C  3.628001 1.531975 0.09132
C  5.488779 -0.191472 0.372416
H  -2.334949 -0.733036 -1.501904
H  -3.345945 -2.342705 0.080811
H  -2.184243 -1.877883 1.360578
H  -1.452762 -3.110682 -1.389966
H  -1.587708 -4.051658 0.112583
H  0.822702 -3.345385 -0.620933
H  0.394476 -3.052879 1.073835
H  -0.584504 2.967444 -0.814799
H  -0.899772 2.488661 0.887629
H  -3.036069 2.616413 -0.232187
H  -2.473374 1.667814 -1.648072
H  -4.640083 0.31383 -1.016485
H  -4.536226 -0.653098 0.482113
H  3.327999 -1.90432 0.210783
H  2.009377 2.974033 -0.156548
H  -4.76273 1.451025 1.874208
H  -5.050352 2.399799 0.383787
H  -6.187698 1.110912 0.84072
H  4.402944 2.306859 0.14701
H  5.637652 -1.283305 0.440728
H  6.099543 0.177314 -0.47402
H  5.90421 0.261164 1.293275
