program: Gaussian 09
title: 000206774
version: EM64L-G09RevD.01
frameworkgroup: C1[X(C16H13N3)]
method: RPBEPBE
basis: SDD
operation: Freq
keyword: #pfreq=noraman
keyword: PBEPBE/SDD
title: #p freq=noraman PBEPBE/SDD
converged: YES YES NO YES
title: Mulliken charges:
elementType: N N N C C C C C C C C C C C C C C C C H H H H H H H H H H H H H
charge: -0.478015 -0.033209 0.001126 0.239262 0.056717 -0.523452 0.146789 0.207642 -0.496898 -0.048691 -0.413070 0.374475 -0.369659 -0.250502 -0.214639 -0.372152 -0.312192 -0.346838 -0.348592 0.232088 0.220596 0.236563 0.225661 0.328376 0.237119 0.236015 0.224221 0.224888 0.261674 0.270173 0.241503 0.243022
chargesum: 0.00000
title: Mulliken charges with hydrogens summed into heavy atoms:
elementType: N N N C C C C C C C C C C C C C C C C
charge: -0.149639 -0.033209 0.001126 0.239262 0.056717 -0.070768 0.146789 0.207642 -0.034674 -0.048691 -0.175951 0.374475 -0.133644 -0.026281 0.010249 -0.110478 -0.042019 -0.105335 -0.105571
polarizability: 2.96440245e+02 -1.16060508e+01 2.10613886e+02 1.12601277e+01 -3.47290985e+00 9.70940518e+01
1716.lowfreq: -0.0004 -0.0003 0.0006 3.5816 6.9596 8.0947 47.4072 63.1662 73.1515
frequency: 47.3889 63.1658 73.1509 104.0099 147.8175 186.0570 206.8448 252.6112 267.7860 274.4032 318.7584 337.6534 372.1915 421.9621 434.7549 494.1580 519.8191 538.2693 553.6005 570.9672 579.8364 605.9614 627.0415 661.8310 666.2406 715.7614 724.8335 752.7009 756.3356 763.5465 800.5457 831.6871 842.1361 854.0098 880.3334 897.0255 926.1499 937.4030 957.5853 975.6096 975.8226 981.2701 990.8206 1006.6371 1019.5578 1037.8223 1060.9880 1084.8873 1109.8380 1141.6761 1163.2615 1170.0019 1215.7018 1216.8457 1226.5370 1246.9666 1279.8850 1296.3319 1303.8004 1319.3687 1331.6180 1332.3607 1372.6565 1400.4897 1411.2101 1436.5364 1444.1834 1456.9562 1460.4884 1470.9809 1489.3545 1523.3210 1547.3856 1567.2033 1581.6504 1585.6204 1629.1166 2944.1649 2964.0880 3038.5234 3057.2909 3126.9124 3126.9871 3134.4494 3137.2937 3148.0024 3153.1599 3164.9213 3174.4602 3599.8890
redmass: 4.4364 5.0296 4.7227 4.3126 4.1412 3.5649 3.4301 4.8257 4.2552 5.2300 3.4995 5.1986 2.5424 4.0147 3.5721 4.1746 4.2573 1.5178 3.6970 3.7653 2.7986 6.2205 5.3916 6.6194 5.4693 3.3243 3.9644 1.5654 3.2325 3.0719 5.0778 2.9132 1.5774 1.4761 5.3850 1.2738 2.5378 1.3771 5.0452 1.3316 1.4567 1.5429 3.7632 2.3835 2.7802 2.3458 2.0783 1.6041 2.1909 2.1844 1.1850 1.1306 1.3666 1.2879 1.5354 2.0127 2.9136 4.7442 1.3513 2.3565 1.4219 1.7760 2.3672 1.9619 3.3016 3.4157 1.1526 1.5606 1.7255 2.8413 3.4014 6.5413 7.2230 7.9346 6.1924 5.7626 7.3366 1.0699 1.0647 1.0946 1.0933 1.0851 1.0878 1.0891 1.0900 1.0955 1.0965 1.1002 1.0961 1.0807
irintensity: 0.3733 0.1997 0.3792 0.4166 0.4778 2.0447 1.4711 8.8834 7.4678 1.0945 3.5222 2.2467 0.5439 1.1332 10.6739 8.3804 11.3200 67.9026 18.2178 1.6771 9.3819 16.5268 2.4035 5.0578 12.7850 5.7853 35.5987 84.8277 1.6927 12.5531 3.6873 2.9519 40.7980 0.1158 2.7691 2.6126 2.3945 2.3711 3.0100 0.5830 2.7763 0.4093 16.8278 4.5996 2.5226 3.2997 11.9229 0.5754 5.4477 11.2322 8.8759 1.8420 5.6975 4.0500 24.8927 9.7727 49.5039 1.1437 15.8475 60.1070 8.7382 83.7674 37.1335 20.3818 0.9557 15.3315 5.9591 16.7007 4.3500 5.4069 3.3070 97.2943 33.2462 15.6891 1.1796 21.2561 3.8082 34.0152 38.6309 26.7866 45.6247 0.3376 13.2136 1.9968 25.0198 28.9492 14.6248 35.7374 5.9340 61.6199
temp: 298.150 k
press: 1.00000 atm
elementType: 7 7 7 6 6 6 6 6 6 6 6 6 6 6 6 6 6 6 6 1 1 1 1 1 1 1 1 1 1 1 1 1
symmnumber: 1
zpe: 661542.3 jmol-1
zpe.correction: 0.251968 hartree
zpe.thermalcorrener: 0.266166 hartree
zpe.thermalcorrenthalpy: 0.267110 hartree
zpe.thermalcorrgfe: 0.210538 hartree
zpe.sumelectzpe: -780.455169 hartree
zpe.sumelectthermal: -780.440972 hartree
zpe.sumelectthermalent: -780.440028 hartree
zpe.sumelectthermalfe: -780.496600 hartree
dipole: 3.3521 -0.0533 -0.5767
dipole: 3.4017
quadrupole: -121.3544 -100.5157 -112.0983
quadrupole: -3.3993 3.7709 0.1603
quadrupole: -10.0316 10.8071 -0.7755 -3.3993 3.7709 0.1603
hfenergy: -780.7071376 hartree
pointgroup: C01 [X(C16H13N3)]
dipole: -1.3193877 0.0165733 -0.2238282 debye
polarizability: 296.4670667|-11.2847688|210.5262194|-11.7471297|3.5791139|97.1548971 unknown
InChI: InChI=1S/C16H13N3/c1-2-4-14-12(3-1)13-7-10-18-15(16(13)19-14)11-5-8-17-9-6-11/h1-6,8-9,19H,7,10H2
charge 0 multiplicity 1
32 atoms
N  -0.630334 0.963333 -0.331707
N  1.32111 -2.232518 -0.108818
N  4.703183 1.575174 0.138929
C  -1.353372 -1.144448 0.200478
C  -0.222727 -0.359265 -0.067268
C  -1.161012 -2.606523 0.52007
C  -2.506256 -0.284998 0.117481
C  -2.023506 1.032801 -0.235578
C  0.113973 -3.103342 -0.220697
C  1.132397 -0.922224 -0.06136
C  -3.904073 -0.484151 0.291863
C  2.343658 -0.047302 0.007768
C  -2.896605 2.127176 -0.424729
C  -4.7735 0.605573 0.108689
C  -4.275026 1.896763 -0.247119
C  2.342567 1.201796 0.6846
C  3.56062 -0.468128 -0.588192
C  3.532238 1.964834 0.723959
C  4.695897 0.363302 -0.500434
H  -1.049787 -2.753825 1.614701
H  -2.02706 -3.216458 0.202828
H  0.402275 -4.107175 0.135699
H  -0.111268 -3.194022 -1.306878
H  -0.014743 1.718091 -0.628502
H  -4.29696 -1.470249 0.563214
H  -2.522858 3.120592 -0.696073
H  -5.852655 0.46897 0.238335
H  -4.980606 2.723803 -0.383437
H  1.453802 1.557117 1.21676
H  3.599409 -1.435689 -1.096199
H  3.56033 2.926768 1.248852
H  5.646389 0.063222 -0.955432
