program: Gaussian 09
title: 000206765
version: EM64L-G09RevD.01
frameworkgroup: C1[X(C11H12N2O3)]
method: RPBEPBE
basis: SDD
operation: Freq
keyword: #p
keyword: freq=noraman
keyword: PBEPBE/SDD
title: #p freq=noraman PBEPBE/SDD
converged: YES YES NO NO
title: Mulliken charges:
elementType: O O O N N C C C C C C C C C C C H H H H H H H H H H H H
charge: -0.302479 -0.435925 -0.183028 -0.434816 -0.012255 0.266702 -0.716434 -0.717238 0.401955 0.190285 0.271730 -0.470857 0.120842 -0.368796 -0.322582 -0.460853 0.249666 0.236338 0.243060 0.243336 0.249585 0.236912 0.234117 0.263875 0.238690 0.265112 0.325334 0.387723
chargesum: 0.00000
title: Mulliken charges with hydrogens summed into heavy atoms:
elementType: O O O N N C C C C C C C C C C C
charge: -0.302479 -0.048202 -0.183028 -0.109482 -0.012255 0.266702 0.012629 0.012596 0.401955 0.190285 0.271730 -0.236740 0.120842 -0.104921 -0.083891 -0.195741
polarizability: 2.04645978e+02 5.12669193e+00 1.45092082e+02 -1.11546152e-01 1.13781178e-02 7.66972868e+01
1716.lowfreq: -2.4743 -0.0006 0.0003 0.0006 1.6470 12.0257 28.0884 39.2671 61.0418
frequency: 27.8872 39.2566 61.0114 88.6987 131.0010 163.5715 180.2053 201.3305 227.8697 254.3603 272.4808 325.0275 334.5017 350.7914 395.4533 406.3290 431.0384 486.0845 511.5443 526.7339 580.6619 591.6560 599.7649 610.7565 646.1795 702.5605 724.0556 745.4683 746.4637 788.0600 810.0859 819.2644 863.4995 863.8978 916.8515 925.2011 925.5161 950.9980 956.4989 1010.2754 1017.0388 1045.9561 1125.6635 1153.2310 1167.8455 1171.6363 1200.4438 1211.9791 1240.2846 1255.8405 1284.8611 1301.4380 1340.9926 1380.3799 1387.7406 1398.9878 1425.9572 1461.9431 1466.4844 1467.3370 1475.3919 1485.9099 1489.7303 1587.9253 1633.1004 1683.7752 3009.2261 3011.2614 3107.6570 3110.7918 3119.7437 3122.9787 3147.6014 3174.7906 3191.0571 3223.5582 3524.8180 3628.6105
redmass: 4.7235 10.3555 3.5965 5.9980 1.5396 2.6755 2.7247 1.3511 4.4114 3.8348 2.6274 4.2274 3.0026 4.9807 4.0359 4.5884 2.9531 6.6047 5.6740 1.6941 1.1816 3.7129 6.5922 2.4239 3.0546 4.8801 5.3521 4.6001 3.4861 5.5358 1.5391 1.2463 1.6416 3.2241 4.3681 1.5818 2.4743 1.3243 2.7557 1.2760 3.1638 4.7278 1.4422 1.8246 2.3213 4.0786 1.9480 1.8845 2.2638 1.9510 2.2838 2.3832 3.4277 1.1796 3.2702 1.2365 2.4655 1.0468 3.6045 1.0557 1.1750 1.8206 1.4528 6.3554 7.5797 9.7441 1.0353 1.0360 1.1001 1.0996 1.1000 1.0997 1.0889 1.0964 1.0908 1.0974 1.0642 1.0820
irintensity: 2.7522 0.5710 0.8531 2.1762 0.0468 0.0011 0.5484 0.0027 0.5857 1.0370 0.7134 4.2521 3.3214 0.0144 4.6524 1.6983 2.8584 9.4748 5.7778 53.9945 136.6309 27.6461 0.8899 36.1738 32.2668 7.0964 26.6259 6.3205 2.7499 24.1203 41.1987 18.3928 46.9908 7.0242 29.1137 2.8011 22.6764 0.0618 28.1370 0.5490 411.2790 2.8299 19.7772 141.7068 88.7130 22.2713 119.1009 36.3239 17.7263 6.5849 5.9371 38.8767 31.8390 29.4371 23.2724 13.9863 7.4903 1.8237 24.9814 0.1712 33.4411 31.7937 101.5300 14.2428 30.7988 209.8818 15.9819 4.6833 6.8605 15.6866 0.6333 41.4839 7.4252 5.5221 13.3599 3.0536 32.2040 81.3475
temp: 298.150 k
press: 1.00000 atm
elementType: 8 8 8 7 7 6 6 6 6 6 6 6 6 6 6 6 1 1 1 1 1 1 1 1 1 1 1 1
symmnumber: 1
zpe: 564798.1 jmol-1
zpe.correction: 0.215120 hartree
zpe.thermalcorrener: 0.229974 hartree
zpe.thermalcorrenthalpy: 0.230918 hartree
zpe.thermalcorrgfe: 0.172383 hartree
zpe.sumelectzpe: -760.356151 hartree
zpe.sumelectthermal: -760.341298 hartree
zpe.sumelectthermalent: -760.340354 hartree
zpe.sumelectthermalfe: -760.398889 hartree
dipole: 1.5493 -0.8781 0.0120
dipole: 1.7809
quadrupole: -86.1274 -90.6261 -94.9228
quadrupole: -19.3221 0.0285 0.0034
quadrupole: 4.4314 -0.0673 -4.3641 -19.3221 0.0285 0.0034
hfenergy: -760.5712717 hartree
pointgroup: C01 [X(C11H12N2O3)]
dipole: -0.5924931 0.2735744 0.2550289 debye
polarizability: 204.9063647|3.9361349|116.9536409|-1.0712062|33.4118078|104.5753411 unknown
InChI: InChI=1S/C11H12N2O3/c1-11(2,10(14)15)16-8-3-4-9-7(5-8)6-12-13-9/h3-6,13-14H,1-2H3
charge 0 multiplicity 1
28 atoms
O  -1.347782 -0.700833 -0.252807
O  -4.672381 0.333449 0.737373
O  -3.905491 -1.338551 -0.677264
N  4.225591 -0.55049 -0.307979
N  4.547218 0.497329 0.554816
C  -2.272062 0.164048 0.511239
C  -2.191071 1.642986 0.054456
C  -2.113174 -0.029229 2.041336
C  0.056712 -0.592737 -0.207297
C  2.245222 0.244746 0.418999
C  2.852567 -0.744458 -0.425287
C  0.827794 0.324518 0.531522
C  -3.654618 -0.39792 0.09398
C  0.682717 -1.575615 -1.047348
C  2.074063 -1.666129 -1.16874
C  3.349096 0.973624 0.990758
H  -3.011192 2.217649 0.514514
H  -1.233535 2.103133 0.342545
H  -2.286015 1.704947 -1.043258
H  -2.148849 -1.10355 2.291498
H  -2.934518 0.484562 2.566715
H  -1.156047 0.37581 2.404118
H  0.384189 1.08348 1.177188
H  0.022144 -2.25578 -1.593168
H  2.52866 -2.42294 -1.81567
H  3.33329 1.809494 1.687927
H  4.98349 -1.058437 -0.756107
H  -5.55512 -0.035703 0.464543
