program: Gaussian 09
title: 000206763
version: EM64L-G09RevD.01
frameworkgroup: C1[X(C15H25NO)]
method: RPBEPBE
basis: SDD
operation: Freq
keyword: #p
keyword: freq=noraman
keyword: PBEPBE/SDD
title: #p freq=noraman PBEPBE/SDD
converged: NO YES NO NO
title: Mulliken charges:
elementType: O N C C C C C C C C C C C C C C C H H H H H H H H H H H H H H H H H H H H H H H H H
charge: -0.264384 -0.609197 -0.007141 -0.041494 -0.469771 -0.471610 -0.482658 -0.500267 -0.405942 -0.411061 -0.381580 -0.579425 0.387321 -0.427291 -0.299658 -0.701245 0.172341 0.195964 0.207242 0.190379 0.202334 0.219903 0.191725 0.208759 0.211622 0.222844 0.216598 0.196144 0.191669 0.190866 0.196306 0.199345 0.187325 0.223845 0.218255 0.236848 0.239309 0.256297 0.223610 0.204795 0.336997 0.324081
chargesum: 0.00000
title: Mulliken charges with hydrogens summed into heavy atoms:
elementType: O N C C C C C C C C C C C C C C C
charge: -0.264384 0.051880 0.188823 0.165748 -0.077057 -0.059982 -0.062277 -0.060825 -0.018129 -0.023890 0.005091 -0.137325 0.387321 -0.190444 -0.060348 -0.016543 0.172341
polarizability: 2.11316260e+02 6.29776365e+00 1.53727098e+02 2.25078507e+00 -1.93673675e+00 1.32164031e+02
1716.lowfreq: -5.5895 -0.0006 -0.0003 0.0002 3.9710 12.6688 18.4383 37.6654 46.5159
frequency: 18.3538 37.6250 45.7999 62.4711 93.8808 106.8089 162.4163 165.9549 193.9831 204.1046 214.7570 221.8760 272.0202 300.6696 317.2328 345.4209 370.4264 390.6029 401.1028 429.9015 449.4697 471.2963 478.4054 516.1036 549.5597 556.4528 563.8494 609.4891 661.9560 711.4850 768.8990 784.6938 789.9080 799.2971 814.0761 839.4350 856.0524 881.8298 892.1838 916.3840 920.8135 940.1743 964.6933 967.7600 988.1579 1037.9006 1052.3519 1054.2602 1057.4567 1057.9317 1074.5185 1081.5318 1086.9438 1102.2674 1115.4979 1124.6477 1132.1501 1145.1201 1161.5111 1189.4765 1193.3491 1231.9114 1250.6853 1259.0061 1261.0850 1265.2745 1274.0401 1279.0369 1299.7841 1306.3406 1311.1356 1320.3806 1327.5900 1328.9726 1337.0182 1338.6881 1341.3182 1344.0343 1349.5354 1363.9396 1379.2677 1386.7455 1450.6418 1455.3255 1459.3940 1462.3078 1463.1072 1465.7201 1467.6093 1471.1918 1476.6343 1476.8987 1569.2661 1630.0609 1682.8219 2918.0827 2928.7533 2938.7230 2941.5620 2948.1204 2949.4996 2958.1847 2962.7626 2963.7208 2964.6484 2971.8665 2992.1079 2996.2974 3002.4961 3022.5295 3024.6485 3030.6324 3032.0140 3040.8063 3049.6688 3086.3804 3088.5726 3106.2286 3502.6599 3661.3513
redmass: 4.0115 4.3511 3.3802 3.8511 3.3591 3.3554 3.1874 2.8555 2.1507 1.2833 2.1808 1.8546 3.1707 2.2255 2.2352 3.3381 3.0600 2.1872 2.9735 3.0240 2.2865 2.2979 2.3271 2.5670 2.9399 2.1470 1.3973 1.5524 2.1473 2.6366 2.9331 1.4632 2.1336 2.8607 1.5481 1.7818 1.8410 1.9162 1.4438 2.1556 1.6706 1.9469 2.0014 2.2177 2.2259 1.9617 1.8459 2.0875 1.7813 1.3600 1.3398 2.0138 2.0049 2.2740 2.6575 1.6885 2.0943 1.2360 2.1536 1.4636 1.4865 1.2913 1.3748 1.2803 1.1887 1.4314 1.2915 1.3025 1.2643 1.3125 1.2969 1.4827 1.5276 2.2385 1.5599 1.4214 1.5528 1.5487 1.6879 1.5614 1.6063 1.2472 1.0920 1.0811 1.0878 1.0891 1.0887 1.0491 1.0799 1.0875 1.0916 1.0637 1.4211 4.0458 6.4011 1.0791 1.0728 1.0750 1.0658 1.0784 1.0651 1.0667 1.0613 1.0589 1.0668 1.0690 1.0354 1.0904 1.0923 1.0975 1.0955 1.0976 1.0983 1.1018 1.0969 1.0934 1.0973 1.1004 1.0442 1.1044
irintensity: 2.1215 4.8631 0.4230 2.0715 0.6365 0.1457 0.6777 0.4386 0.5445 0.0475 0.0623 0.0547 12.7205 0.6442 0.7096 0.8474 3.0947 0.5505 6.8971 0.0621 0.2109 1.0210 3.3013 11.0340 18.1809 46.7747 157.7285 4.7081 22.2892 2.0495 4.1404 0.2697 0.5693 4.8029 2.2205 3.9236 7.5131 1.9443 13.7690 1.0944 4.8974 3.1656 9.8790 4.6375 18.3495 2.8109 1.7994 0.9428 1.2391 0.3225 0.9878 2.0666 18.3521 0.6083 0.2651 1.9823 1.6617 4.3562 1.1951 0.9931 0.9888 4.3565 1.5263 2.2504 4.6450 3.4151 3.7286 2.5388 1.5847 0.2318 1.9747 23.3006 7.9079 52.1746 12.2141 0.1522 1.8216 4.0116 7.8126 3.6297 2.9078 24.7922 1.1542 9.3665 1.2047 3.1822 9.8152 19.0263 10.9511 14.3521 1.9237 12.4406 126.8263 289.9628 0.4091 1.9348 18.8592 20.7426 22.9474 33.1960 19.2170 56.3063 28.9168 40.8375 40.1340 31.5450 20.0664 36.0230 40.6828 84.4909 92.7616 12.9227 14.1230 141.7938 46.9309 10.7188 48.5249 19.4353 24.3328 58.1541
temp: 298.150 k
press: 1.00000 atm
elementType: 8 7 6 6 6 6 6 6 6 6 6 6 6 6 6 6 6 1 1 1 1 1 1 1 1 1 1 1 1 1 1 1 1 1 1 1 1 1 1 1 1 1
symmnumber: 1
zpe: 980243.0 jmol-1
zpe.correction: 0.373355 hartree
zpe.thermalcorrener: 0.390912 hartree
zpe.thermalcorrenthalpy: 0.391856 hartree
zpe.thermalcorrgfe: 0.327010 hartree
zpe.sumelectzpe: -715.240270 hartree
zpe.sumelectthermal: -715.222713 hartree
zpe.sumelectthermalent: -715.221769 hartree
zpe.sumelectthermalfe: -715.286614 hartree
dipole: -4.4887 -0.1241 -1.1447
dipole: 4.6341
quadrupole: -139.3733 -99.2798 -102.6607
quadrupole: 1.9372 -4.0373 2.7080
quadrupole: -25.6021 14.4915 11.1106 1.9372 -4.0373 2.7080
hfenergy: -715.6136248 hartree
pointgroup: C01 [X(C15H25N1O1)]
dipole: 1.7625938 -0.0960216 -0.4560979 debye
polarizability: 211.0906597|5.6957036|152.3540438|-5.1087297|-5.9293085|133.7626848 unknown
InChI: InChI=1S/C15H25NO/c1-11(15(16)17)12-7-9-14(10-8-12)13-5-3-2-4-6-13/h7,11,13-14H,2-6,8-10,16H2,1H3
charge 0 multiplicity 1
42 atoms
O  -5.622096 0.513677 -0.363745
N  -3.771855 0.941301 -1.689139
C  2.427448 -0.051578 0.24336
C  0.910153 -0.210348 -0.089832
C  3.278958 -1.203952 -0.360407
C  2.998342 1.313678 -0.234105
C  0.296254 -1.498618 0.519028
C  0.071143 1.00658 0.387799
C  4.788189 -1.055015 -0.053954
C  4.508276 1.465809 0.068976
C  5.331371 0.307896 -0.538822
C  -1.162978 -1.711945 0.062243
C  -2.011539 -0.452617 0.182851
C  -1.427711 0.766849 0.357031
C  -3.528795 -0.668978 0.200716
C  -4.066429 -0.766482 1.65413
C  -4.393023 0.33094 -0.614256
H  2.533942 -0.091994 1.352377
H  0.81347 -0.278719 -1.197308
H  3.130169 -1.213049 -1.461992
H  2.930075 -2.183769 0.016081
H  2.449847 2.147949 0.241969
H  2.833695 1.405088 -1.329742
H  0.324824 -1.413196 1.625196
H  0.892658 -2.388343 0.247857
H  0.302709 1.896805 -0.23011
H  0.376119 1.27876 1.423385
H  5.351525 -1.884481 -0.524588
H  4.94784 -1.141175 1.041205
H  4.658002 1.47791 1.1690
H  4.872381 2.439952 -0.312514
H  6.40149 0.414402 -0.274513
H  5.266398 0.354315 -1.64601
H  -1.628945 -2.520764 0.662214
H  -1.183991 -2.073236 -0.989016
H  -2.06469 1.65327 0.497142
H  -3.73085 -1.649207 -0.285596
H  -5.152702 -0.954012 1.643592
H  -3.884558 0.177097 2.197441
H  -3.560323 -1.583357 2.199648
H  -2.764271 0.86117 -1.822286
H  -4.326317 1.553487 -2.286704
