program: Gaussian 09
title: 000206756
version: EM64L-G09RevD.01
frameworkgroup: C1[X(C14H22O2)]
method: RPBEPBE
basis: SDD
operation: Freq
keyword: #pfreq=noraman
keyword: PBEPBE/SDD
title: #p freq=noraman PBEPBE/SDD
converged: YES YES NO NO
title: Mulliken charges:
elementType: O O C C C C C C C C C C C C C C H H H H H H H H H H H H H H H H H H H H H H
charge: -0.409923 -0.243052 -0.005868 -0.043361 -0.468848 -0.471746 -0.489317 -0.488185 -0.405639 -0.410151 -0.381989 -0.541221 -0.400821 0.411158 -0.620790 0.206575 0.195702 0.210836 0.190107 0.202912 0.218511 0.192850 0.208525 0.212013 0.226024 0.213165 0.195314 0.191154 0.189860 0.195183 0.198147 0.187449 0.260139 0.210094 0.213216 0.231179 0.247598 0.373199
chargesum: 0.00000
title: Mulliken charges with hydrogens summed into heavy atoms:
elementType: O O C C C C C C C C C C C C C C
charge: -0.036724 -0.243052 0.189834 0.167475 -0.075828 -0.060385 -0.068779 -0.048995 -0.019171 -0.025108 0.003607 -0.070988 -0.187605 0.411158 -0.142012 0.206575
polarizability: 1.92555723e+02 -4.89861886e+00 1.47055747e+02 5.04525389e-01 2.18019139e+00 1.17000286e+02
1716.lowfreq: -17.6423 -0.0009 -0.0006 0.0005 6.1857 14.1784 30.5946 31.7160 43.1473
frequency: 30.0702 31.6280 42.8768 57.6782 86.8684 114.1668 144.7492 196.9041 209.7036 233.1659 271.3760 284.5703 305.6224 361.8732 385.9620 395.0436 426.6554 443.8890 448.8854 471.2853 499.1543 527.7861 544.3820 612.4146 664.3945 710.9241 776.6679 780.0795 788.5877 801.7815 823.5408 846.6106 869.9117 882.7146 890.6431 905.4754 916.1091 917.5931 946.2131 967.9534 988.9885 1038.4059 1049.2739 1054.1562 1055.6888 1066.9180 1074.9824 1097.4746 1113.3979 1125.0697 1131.8979 1141.2706 1151.4953 1183.3238 1190.2434 1194.7894 1233.4181 1248.7358 1257.4758 1259.8139 1265.5220 1274.6869 1295.8674 1303.7837 1306.7767 1313.6132 1323.8971 1326.4847 1335.9775 1336.9338 1339.1568 1342.7624 1348.2712 1363.4494 1382.8783 1446.6112 1453.2962 1457.1656 1460.8138 1461.0768 1463.6985 1467.1627 1470.6163 1475.6958 1654.9243 1692.5221 2917.7039 2929.9901 2941.7216 2945.9406 2949.9683 2958.4727 2961.9848 2962.7608 2964.0792 2973.9263 3000.6769 3007.7397 3016.1492 3022.0460 3023.2874 3029.6021 3031.9726 3040.1889 3047.9093 3092.1275 3098.5998 3502.5452
redmass: 4.8656 3.7223 6.2033 3.3138 4.2209 3.2621 4.1058 2.0076 1.7999 3.2833 3.6671 3.3838 1.8199 2.6512 2.1702 2.4198 2.9834 2.3023 2.7126 2.1667 2.4090 3.3319 2.6701 1.9588 1.7292 2.7896 3.4350 1.4725 2.1429 1.4929 2.6924 1.8632 2.9098 2.0729 1.4572 2.1220 1.7990 1.7693 2.1081 2.2012 2.2045 2.4423 1.6502 1.8166 1.3555 2.2333 1.4453 2.3531 2.5736 1.7618 2.1285 1.2001 2.4676 1.2449 1.4289 1.4461 1.2563 1.3691 1.2851 1.1890 1.4058 1.2812 1.3287 1.2842 1.3505 1.4380 1.5406 1.4342 1.4494 1.4719 1.5262 1.5102 1.6898 1.5454 1.6934 1.0933 1.0913 1.0876 1.0875 1.0904 1.0798 1.0821 1.0916 1.0953 8.3760 6.7033 1.0798 1.0715 1.0764 1.0668 1.0648 1.0670 1.0611 1.0592 1.0662 1.0647 1.0634 1.0924 1.0918 1.0975 1.0957 1.0979 1.0985 1.1018 1.0970 1.0920 1.0972 1.0638
irintensity: 0.4595 0.1850 2.1344 0.1209 0.6349 0.0603 0.5811 0.7350 0.1086 1.2017 0.3214 0.2921 0.8055 0.3791 2.4591 3.2227 0.1063 0.3856 2.5545 0.5732 11.4985 14.4629 36.5661 53.0885 101.9955 17.7367 1.3383 0.1587 0.7382 8.8047 10.9466 2.2412 12.6610 2.1099 13.5809 11.8543 1.1874 5.3945 10.6443 20.4600 13.0307 13.6456 114.2224 5.6182 46.5810 22.0371 17.5189 7.0569 0.8966 2.5368 11.0848 4.1778 29.8916 10.6367 2.2266 1.0477 3.3410 1.2654 4.2564 3.8198 0.3058 4.1252 3.3152 2.7273 5.4138 18.6538 38.5128 0.7624 2.7241 6.4433 1.6017 3.7366 15.6497 1.8325 1.2041 16.7479 3.9564 0.7382 5.1243 6.5828 16.0502 11.7333 13.9584 2.7317 219.7965 0.8717 4.0837 19.5557 15.9183 31.5111 19.0755 49.4805 32.2585 42.6417 38.8791 44.9885 19.2413 29.3465 10.7010 87.8777 92.6157 10.8641 14.3602 151.4410 44.1190 23.4810 18.2383 19.7932
temp: 298.150 k
press: 1.00000 atm
elementType: 8 8 6 6 6 6 6 6 6 6 6 6 6 6 6 6 1 1 1 1 1 1 1 1 1 1 1 1 1 1 1 1 1 1 1 1 1 1
symmnumber: 1
zpe: 873607.5 jmol-1
zpe.correction: 0.332740 hartree
zpe.thermalcorrener: 0.348657 hartree
zpe.thermalcorrenthalpy: 0.349602 hartree
zpe.thermalcorrgfe: 0.287938 hartree
zpe.sumelectzpe: -695.883702 hartree
zpe.sumelectthermal: -695.867784 hartree
zpe.sumelectthermalent: -695.866839 hartree
zpe.sumelectthermalfe: -695.928503 hartree
dipole: 0.8196 -1.2318 0.2130
dipole: 1.4948
quadrupole: -97.6109 -102.2190 -94.2706
quadrupole: 5.6878 1.0974 1.6800
quadrupole: 0.4226 -4.1855 3.7629 5.6878 1.0974 1.6800
hfenergy: -696.2164411 hartree
pointgroup: C01 [X(C14H22O2)]
dipole: 0.3120775 0.4898818 -0.0921122 debye
polarizability: 192.3128984|5.9110322|147.3876033|-0.0044236|1.5323301|116.9112542 unknown
InChI: InChI=1S/C14H22O2/c15-14(16)10-11-6-8-13(9-7-11)12-4-2-1-3-5-12/h6,12-13,15H,1-5,7-10H2
charge 0 multiplicity 1
38 atoms
O  -5.239877 0.656102 0.768728
O  -4.576374 -1.557058 0.548719
C  2.177682 -0.011624 0.243991
C  0.737402 0.008032 -0.361232
C  2.974845 -1.270013 -0.199957
C  2.988462 1.263868 -0.118778
C  -0.13365 -1.178887 0.127945
C  -0.012004 1.333286 -0.052752
C  4.411968 -1.300859 0.374035
C  4.427086 1.236496 0.452361
C  5.197232 -0.024072 -0.000907
C  -1.49935 -1.229783 -0.592514
C  -1.49623 1.277737 -0.364571
C  -2.176157 0.130661 -0.634801
C  -3.664102 0.160508 -0.995832
C  -4.512628 -0.372648 0.148153
H  2.075523 -0.042996 1.353807
H  0.835021 -0.076101 -1.467097
H  3.027225 -1.279933 -1.310171
H  2.44436 -2.192583 0.101908
H  2.4697 2.167539 0.252627
H  3.035648 1.353134 -1.225797
H  -0.299324 -1.07141 1.219991
H  0.388127 -2.140731 -0.02536
H  0.43732 2.168986 -0.624232
H  0.128795 1.596167 1.019877
H  4.94343 -2.201944 0.009937
H  4.361112 -1.384425 1.479843
H  4.376825 1.249748 1.561425
H  4.971029 2.152011 0.147079
H  6.207214 -0.043439 0.453153
H  5.339089 0.008633 -1.101404
H  -2.168661 -1.958822 -0.095096
H  -1.366368 -1.601617 -1.631906
H  -2.034149 2.237336 -0.377991
H  -3.846692 -0.491263 -1.872111
H  -3.989593 1.183982 -1.237729
H  -5.751538 0.27578 1.53456
