program: Gaussian 09
title: 000015503
version: EM64L-G09RevD.01
frameworkgroup: C1[X(C14H12N4O4)]
method: RPBEPBE
basis: SDD
operation: Freq
keyword: #p
keyword: freq=noraman
keyword: PBEPBE/SDD
title: #p freq=noraman PBEPBE/SDD
converged: NO YES NO NO
title: Mulliken charges:
elementType: O O O O N N N N C C C C C C C C C C C C C C H H H H H H H H H H H H
charge: -0.186697 -0.272198 -0.211232 -0.205849 -0.426061 -0.056915 0.023473 0.016057 0.303490 0.257067 -0.288270 0.326377 -0.497575 0.446674 0.088182 -0.367904 -0.362689 -0.346233 -0.792951 -0.237541 -0.225868 -0.228097 0.293912 0.335975 0.292859 0.376456 0.220524 0.261179 0.252783 0.257677 0.251410 0.232509 0.233257 0.236220
chargesum: 0.00000
title: Mulliken charges with hydrogens summed into heavy atoms:
elementType: O O O O N N N N C C C C C C C C C C C C C C
charge: -0.186697 -0.272198 -0.211232 -0.205849 -0.049605 -0.056915 0.023473 0.016057 0.303490 0.257067 0.005642 0.326377 -0.161600 0.446674 0.088182 -0.075045 -0.142165 -0.085053 -0.031081 -0.005033 0.007390 0.008123
polarizability: 4.88326240e+02 1.77777710e+00 2.48381639e+02 -5.42337997e+00 4.90523650e+00 8.05480319e+01
1716.lowfreq: -3.5634 0.0005 0.0008 0.0008 3.1484 4.9786 21.9151 32.7364 45.5914
frequency: 21.9071 32.7044 45.5910 53.9703 63.2815 78.3172 113.5515 136.4511 144.0091 156.4924 164.0605 178.2003 212.4849 286.7022 302.1733 323.4988 353.3004 367.2278 391.8026 401.8570 410.3430 439.6489 462.5158 488.0806 513.2943 515.3476 571.6119 599.2249 613.0429 615.7384 650.2798 652.6936 677.7647 694.0323 705.7491 723.5559 749.1721 754.5257 775.4340 838.7691 846.7147 849.6645 861.4779 891.5381 930.2410 963.4111 963.7495 982.4698 988.2669 1003.1142 1009.9949 1022.1517 1027.5520 1046.6812 1070.0292 1079.9801 1099.2403 1101.5353 1136.9472 1166.3570 1175.5343 1194.6065 1211.1804 1232.5393 1298.0663 1309.8170 1319.3064 1342.5312 1361.7174 1381.5309 1387.8886 1395.8572 1431.9997 1447.6861 1459.7522 1478.4270 1482.8655 1493.0888 1521.7365 1523.8911 1580.6261 1585.8867 1609.4244 1621.7825 2973.8000 3042.2661 3130.6074 3133.6439 3139.9717 3152.6191 3164.2520 3174.6347 3179.9976 3189.7853 3202.2887 3213.2918
redmass: 4.1685 6.0852 6.8415 6.4967 6.8440 8.4187 4.7778 1.7032 3.0988 8.2883 4.1978 4.6570 7.0658 5.4082 5.9375 4.8198 4.7821 11.8649 5.0339 2.9384 6.6704 4.0726 5.2418 5.4860 5.5688 4.0362 2.9706 4.8457 6.2510 6.2650 7.7184 6.4654 9.9748 1.7400 7.8249 4.9577 5.3800 9.4798 1.8196 1.1962 2.3990 1.6574 1.3880 6.5244 1.4127 3.0366 1.4069 1.5134 4.3501 1.3370 1.3185 2.2716 1.6760 2.2969 1.9570 2.9468 2.7511 2.4380 1.3403 9.8617 1.0552 1.1226 5.3595 1.8244 2.3391 2.4554 1.6836 4.4099 6.9904 6.6919 4.2179 1.2259 2.3320 5.3247 1.3775 1.4857 2.4014 1.6737 2.9726 4.6212 4.9434 4.8388 6.0281 7.2704 1.0422 1.0971 1.0865 1.0921 1.0884 1.0929 1.0962 1.0995 1.0898 1.0920 1.0958 1.0789
irintensity: 0.2914 1.0930 0.3781 0.0754 0.2332 0.1736 7.3143 2.7110 0.7089 2.1929 1.7783 0.7580 2.9196 0.9779 0.2628 0.1679 2.7140 1.2828 5.2808 0.5466 14.1099 1.2082 2.0073 1.5388 6.6617 13.3912 9.6357 9.6791 1.4206 0.6142 13.7641 8.0436 10.4135 48.5495 8.8915 2.9009 13.3751 3.6798 54.3333 105.4360 8.1530 2.4984 12.2927 3.8631 4.5839 14.7185 24.8497 2.0748 1.3512 0.4656 0.0684 5.6735 2.2143 6.0971 15.2340 45.6876 62.4290 21.7299 55.1772 373.3188 0.5047 10.0369 566.3595 145.2822 74.0228 33.6669 24.4525 319.0777 42.1552 0.1873 62.2204 22.0545 6.8577 2.6792 27.7673 52.5506 3.9544 133.5784 5.2524 69.5309 85.9539 72.2005 7.0066 463.5297 6.2047 8.1461 7.4758 10.0233 0.6670 24.8339 31.0033 20.5451 3.4377 20.8338 0.0851 68.6243
temp: 298.150 k
press: 1.00000 atm
elementType: 8 8 8 8 7 7 7 7 6 6 6 6 6 6 6 6 6 6 6 6 6 6 1 1 1 1 1 1 1 1 1 1 1 1
symmnumber: 1
zpe: 645172.5 jmol-1
zpe.correction: 0.245733 hartree
zpe.thermalcorrener: 0.264735 hartree
zpe.thermalcorrenthalpy: 0.265679 hartree
zpe.thermalcorrgfe: 0.196079 hartree
zpe.sumelectzpe: -1058.856206 hartree
zpe.sumelectthermal: -1058.837204 hartree
zpe.sumelectthermalent: -1058.836260 hartree
zpe.sumelectthermalfe: -1058.905860 hartree
dipole: -9.3254 -0.1509 0.0302
dipole: 9.3266
quadrupole: -144.2023 -135.4470 -128.2716
quadrupole: 2.9578 -1.5830 2.7278
quadrupole: -8.2287 0.5266 7.7020 2.9578 -1.5830 2.7278
hfenergy: -1059.1019391 hartree
pointgroup: C01 [X(C14H12N4O4)]
dipole: -3.6690546 0.0335564 -0.0359251 debye
polarizability: 488.2504075|-0.1539211|248.310179|8.0808982|5.8489447|80.6953242 unknown
InChI: InChI=1S/C14H12N4O4/c1-10(11-5-3-2-4-6-11)15-16-13-8-7-12(17(19)20)9-14(13)18(21)22/h2-9,16H,1H3
charge 0 multiplicity 1
34 atoms
O  3.41732 -3.083578 0.128782
O  1.139615 -3.1184 0.081055
O  4.839952 3.029478 -0.040365
O  5.918903 1.015089 0.019555
N  -0.199249 -0.892441 0.030222
N  -1.367321 -0.14522 0.014117
N  2.28801 -2.468719 0.088861
N  4.846176 1.735427 -0.005672
C  1.024206 -0.260492 0.02024
C  2.261404 -1.009411 0.048988
C  1.112835 1.17056 -0.019819
C  -3.752171 -0.010504 0.007599
C  3.51128 -0.350958 0.041244
C  3.543251 1.047019 0.003147
C  -2.511815 -0.826437 0.013455
C  2.344809 1.817075 -0.028524
C  -5.010664 -0.570156 -0.35212
C  -3.701656 1.372424 0.356428
C  -2.558775 -2.345333 0.024936
C  -6.177423 0.224721 -0.364763
C  -4.866698 2.161078 0.347973
C  -6.113159 1.591597 -0.012627
H  0.176142 1.72943 -0.047904
H  4.435661 -0.933503 0.064749
H  2.41767 2.907299 -0.060612
H  -0.155515 -1.9328 0.04312
H  -5.08827 -1.621137 -0.648974
H  -2.737701 1.804562 0.639623
H  -3.580519 -2.727483 0.148139
H  -2.143784 -2.772196 -0.909533
H  -1.960691 -2.753254 0.86372
H  -7.134807 -0.223533 -0.651561
H  -4.809339 3.21874 0.62758
H  -7.020375 2.205552 -0.016758
