program: Gaussian 09
title: 000206739
version: EM64L-G09RevD.01
frameworkgroup: C1[X(C11H17O3P)]
method: RPBEPBE
basis: SDD
operation: Freq
keyword: #p
keyword: freq=noraman
keyword: PBEPBE/SDD
title: #p freq=noraman PBEPBE/SDD
converged: YES YES NO NO
title: Mulliken charges:
elementType: P O O O C C C C C C C C C C C H H H H H H H H H H H H H H H H H
charge: 1.284197 -0.548079 -0.489234 -0.613243 -0.371440 0.408059 -0.240378 -0.396279 -0.810165 -0.238518 -0.223278 -0.237065 -0.213673 -0.648920 -0.658641 0.292004 0.239937 0.219335 0.254798 0.279199 0.227097 0.219543 0.215148 0.221317 0.237042 0.232081 0.207968 0.221362 0.262775 0.204861 0.233226 0.228964
chargesum: 0.00000
title: Mulliken charges with hydrogens summed into heavy atoms:
elementType: P O O O C C C C C C C C C C C
charge: 1.284197 -0.548079 -0.489234 -0.613243 -0.371440 0.408059 0.051626 -0.156342 -0.056833 0.208122 0.213186 -0.000022 0.018407 0.043185 0.008410
polarizability: 1.79709032e+02 -1.13360037e+00 1.33863254e+02 -2.98204770e+00 1.43534135e+01 1.39214147e+02
1716.lowfreq: -8.9829 -0.0018 -0.0011 0.0007 6.8072 14.9592 22.4391 33.2087 38.9546
frequency: 22.2776 33.0896 38.6486 57.5270 62.8252 98.5131 104.9448 109.7213 136.7539 177.3887 188.6374 226.1822 231.7055 251.3873 253.7530 266.3437 275.5970 346.6418 375.6778 398.6213 430.8389 457.5441 480.9884 526.1184 540.6940 608.6791 668.8721 683.4207 722.5268 766.2559 795.7670 801.7685 811.2721 865.8226 875.2289 884.0397 962.8793 993.8144 999.7492 1013.1797 1019.5085 1026.9414 1044.4526 1052.5767 1057.7843 1096.1951 1104.5723 1134.2061 1138.8323 1148.1986 1176.4185 1215.8851 1256.2098 1270.3581 1281.9812 1351.3875 1358.9062 1367.9259 1388.9997 1394.3919 1408.9238 1424.6610 1457.5598 1460.5680 1461.2149 1463.5715 1465.8443 1477.7821 1481.2376 1487.2204 1490.8264 1577.9618 1602.5134 2970.0691 2982.5828 2987.1087 2993.6526 3001.9183 3034.1318 3061.5905 3073.3723 3083.2591 3090.3837 3095.2778 3107.2030 3111.6034 3126.6610 3141.9169 3157.9790 3174.5136
redmass: 3.0685 3.4481 3.5316 2.0714 2.4232 1.4461 1.9533 3.6864 4.1581 3.1621 3.9604 3.0103 1.7617 2.6074 1.4122 3.3385 3.9486 5.3894 3.7666 3.7329 3.3429 3.4820 6.4680 3.9481 5.7679 7.0709 6.8982 6.4822 3.4079 1.2345 4.7464 1.1334 1.0896 3.4704 3.7345 1.2796 1.3609 1.6131 1.3302 3.2466 4.0473 3.5058 2.5070 1.7547 3.5401 2.1509 2.1941 1.4337 1.5811 1.5622 1.0648 2.4563 1.1394 1.1288 1.4305 1.2248 1.2556 7.6398 1.2303 1.2437 1.2593 1.9346 1.0405 1.0484 1.6076 1.3513 1.0758 1.0570 1.1061 1.0534 1.0820 6.0859 6.1234 1.0569 1.0376 1.0364 1.0366 1.0611 1.1064 1.0966 1.1042 1.0974 1.0983 1.1000 1.1016 1.1032 1.0865 1.0908 1.0956 1.0980
irintensity: 1.3410 0.8250 0.4597 1.7908 1.1895 1.3371 1.0590 0.9646 0.1123 12.0887 9.7368 0.2601 1.7695 3.1423 5.6852 4.7696 13.5903 3.5558 1.6369 7.4568 6.1798 32.1900 50.6255 5.8386 4.0775 77.4542 131.6900 47.1969 15.2669 56.3755 12.6596 3.8168 1.3058 160.0064 110.1988 0.2337 0.4092 2.2624 0.0709 151.6356 166.0243 22.4011 1.4500 13.8120 36.1628 12.1272 9.1132 5.6124 13.2081 9.3324 1.8222 10.3766 0.7521 0.3719 9.5009 14.4110 5.0270 2.0820 33.9917 24.3974 25.6123 1.0695 11.8207 7.2672 31.2190 15.3376 2.5841 9.8393 26.4926 11.2631 6.9610 1.5022 7.9511 30.0742 12.0091 24.3340 26.1474 36.8464 24.2085 5.3944 9.4110 36.1663 29.0309 19.2640 34.6609 24.1302 3.1864 17.4519 17.6908 15.7523
temp: 298.150 k
press: 1.00000 atm
elementType: 15 8 8 8 6 6 6 6 6 6 6 6 6 6 6 1 1 1 1 1 1 1 1 1 1 1 1 1 1 1 1 1
symmnumber: 1
zpe: 681180.8 jmol-1
zpe.correction: 0.259448 hartree
zpe.thermalcorrener: 0.277267 hartree
zpe.thermalcorrenthalpy: 0.278212 hartree
zpe.thermalcorrgfe: 0.211718 hartree
zpe.sumelectzpe: -995.097030 hartree
zpe.sumelectthermal: -995.079210 hartree
zpe.sumelectthermalent: -995.078266 hartree
zpe.sumelectthermalfe: -995.144759 hartree
dipole: 1.6305 0.4057 -3.7545
dipole: 4.1133
quadrupole: -83.0946 -94.7090 -101.2303
quadrupole: 1.9554 6.5438 1.4620
quadrupole: 9.9167 -1.6977 -8.2190 1.9554 6.5438 1.4620
hfenergy: -995.3564777 hartree
pointgroup: C01 [X(C11H17O3P1)]
dipole: 0.5561524 0.127267 1.5143961 debye
polarizability: 179.2553902|0.3064008|139.6102212|5.5705969|14.2677236|133.9208221 unknown
InChI: InChI=1S/C11H17O3P/c1-4-13-15(12,14-5-2)11-9-7-6-8-10(11)3/h6-9H,4-5H2,1-3H3
charge 0 multiplicity 1
32 atoms
P  -0.978749 -0.107071 -0.477231
O  -1.926061 0.923787 0.558524
O  -1.325686 -1.727513 0.089415
O  -1.32613 -0.022971 -2.028897
C  0.736089 0.312488 0.089886
C  1.844946 -0.308625 -0.558603
C  0.917335 1.254764 1.129583
C  3.1425 0.05485 -0.117349
C  1.663606 -1.316854 -1.679168
C  -3.324863 1.235563 0.134072
C  -1.19395 -2.028282 1.542367
C  2.221399 1.59556 1.549145
C  3.33448 0.992785 0.921919
C  -3.361914 2.470896 -0.768996
C  -1.548564 -3.504408 1.707406
H  0.040297 1.715856 1.592208
H  4.011127 -0.406578 -0.601095
H  2.637528 -1.699996 -2.025854
H  1.048036 -2.175789 -1.35115
H  1.131999 -0.866842 -2.537399
H  -3.762424 0.355932 -0.375737
H  -3.854298 1.401761 1.087707
H  -0.155927 -1.820814 1.872795
H  -1.883462 -1.375038 2.111034
H  2.363932 2.324976 2.353342
H  4.350824 1.25329 1.238157
H  -4.411488 2.742034 -0.991941
H  -2.879499 3.330857 -0.272701
H  -2.843311 2.265698 -1.720423
H  -1.478817 -3.795092 2.772277
H  -2.576505 -3.696258 1.3562
H  -0.859144 -4.138168 1.124008
