program: Gaussian 09
title: 000206737
version: EM64L-G09RevD.01
frameworkgroup: C1[X(C16H24N2O3)]
method: RPBEPBE
basis: SDD
operation: Freq
keyword: #p
keyword: freq=noraman
keyword: PBEPBE/SDD
title: #p freq=noraman PBEPBE/SDD
converged: YES YES NO NO
title: Mulliken charges:
elementType: O O O N N C C C C C C C C C C C C C C C C H H H H H H H H H H H H H H H H H H H H H H H H
charge: -0.267636 -0.409462 -0.256001 -0.326993 -0.126833 -0.148582 0.199278 -0.361635 -0.530750 -0.583872 -0.347909 -0.381519 0.492567 0.193510 -0.664293 -0.644711 -0.424203 -0.403544 -0.226540 -0.231202 -0.245161 0.207916 0.290805 0.184751 0.243014 0.248836 0.309264 0.199929 0.234269 0.205785 0.259947 0.222153 0.221973 0.202707 0.254165 0.218304 0.220275 0.232744 0.217987 0.231122 0.240450 0.222087 0.223079 0.225731 0.378198
chargesum: 0.00000
title: Mulliken charges with hydrogens summed into heavy atoms:
elementType: O O O N N C C C C C C C C C C C C C C C C
charge: -0.267636 -0.031264 -0.256001 -0.036187 -0.126833 0.059334 0.199278 0.066130 0.027350 -0.149674 0.117823 0.062607 0.492567 0.193510 0.010883 0.026296 -0.193081 -0.163094 -0.004453 -0.008123 -0.019430
polarizability: 2.20484100e+02 -1.71069083e+01 1.92004879e+02 -1.51683338e+01 -1.17901217e+01 1.69349533e+02
1716.lowfreq: -10.8505 -4.0542 0.0004 0.0004 0.0005 6.6606 11.8124 18.0669 24.4057
frequency: 7.3237 17.9173 24.0800 26.6294 39.4150 47.3599 55.7862 70.4758 76.1099 77.5249 118.0181 130.7647 135.1964 147.1187 200.0705 217.7349 226.3127 236.5510 257.1001 279.1111 314.0015 332.6706 359.2627 365.6850 403.7972 415.9673 425.9156 481.7749 506.2341 527.0557 534.1070 569.9155 595.4162 618.2617 618.5094 655.9076 671.3597 701.2068 705.4412 757.4008 770.5670 776.5714 792.9006 808.8055 816.4215 854.4148 871.9966 879.8856 918.2365 929.2610 948.5028 976.0608 989.8825 992.5343 1009.5722 1018.3603 1026.2062 1033.5930 1040.5826 1070.3705 1076.5692 1079.6451 1081.6516 1096.2635 1104.2653 1130.2924 1159.8019 1171.0190 1179.8645 1186.3223 1200.8153 1206.5655 1217.4525 1242.1547 1251.1133 1277.4688 1282.5728 1294.3992 1300.6875 1321.5926 1327.3334 1339.8989 1357.4946 1361.8825 1368.4902 1382.9670 1385.2846 1389.1739 1408.3354 1418.5535 1440.4265 1453.4811 1465.8503 1470.4371 1474.2144 1476.6442 1478.1113 1483.1934 1484.7109 1488.4281 1495.8668 1580.5718 1593.2918 1614.7097 1652.4115 2842.9242 2902.1693 2983.1378 2983.4891 2984.1999 2998.3892 3004.4161 3009.1669 3018.1934 3054.6618 3055.6302 3065.9624 3068.1397 3082.7481 3085.7986 3091.9349 3102.8924 3113.6052 3115.5108 3130.1708 3141.8741 3160.4119 3424.4012 3508.9551
redmass: 3.7250 4.5605 4.5252 4.7482 5.1958 5.6910 2.8220 3.0410 2.9022 4.4757 3.4492 3.4229 2.2974 4.9343 1.1381 1.2514 5.1171 4.9643 2.8196 2.8448 2.7708 2.5461 4.4242 3.3658 2.8281 3.8926 2.6281 1.9539 2.9594 3.4304 3.2213 3.7199 3.4262 2.7464 5.2236 1.7699 1.7242 5.8070 1.7471 1.9396 1.5363 1.1758 2.0998 1.2636 3.0145 1.2468 2.6401 3.4991 1.4641 2.1422 2.3196 1.3854 6.2396 1.3124 2.4597 2.0371 2.3280 3.3683 2.4327 2.0469 2.3104 1.9986 1.8534 1.8257 1.6779 2.0459 3.0161 1.0597 1.2821 1.1157 1.3616 2.9519 2.3892 1.4441 1.5576 1.2860 1.1974 1.3624 1.3796 1.3707 1.2510 1.2847 1.2831 1.6126 1.5995 7.4479 1.2183 1.2112 2.2593 1.0968 2.1846 1.1078 1.0459 1.0442 1.1055 1.3008 1.0870 1.0603 2.1508 1.1102 1.0961 6.0188 6.0744 6.1954 7.2679 1.0708 1.0804 1.0363 1.0627 1.0358 1.0645 1.0608 1.0630 1.0852 1.1010 1.0982 1.0984 1.0993 1.0991 1.0988 1.1014 1.1022 1.0861 1.0872 1.0911 1.0960 1.1015 1.0742 1.0639
irintensity: 1.6002 0.4110 0.4201 0.1523 0.4631 0.2290 0.0445 1.4985 0.6427 2.4412 4.0446 0.5920 3.3019 3.9384 0.0804 1.1834 0.8331 1.1492 0.8710 0.4446 1.8633 0.9245 4.3559 8.9050 0.0134 1.6840 4.6226 23.4030 12.4571 66.5069 5.4879 24.0782 7.9652 49.0318 8.5602 108.2237 45.4699 5.6926 47.5226 41.3920 23.4371 7.4871 10.4797 2.7785 3.9423 0.0761 3.4412 1.3801 3.4241 10.9819 30.7372 0.0716 0.0915 0.2985 3.5247 24.2246 7.5572 10.6881 229.9519 21.9285 5.5500 81.2418 12.5172 14.8324 22.7814 53.5260 45.7281 0.6455 22.9441 0.4214 6.4481 26.7427 1.4486 23.0323 34.5255 33.1289 3.7730 2.7549 24.9118 56.0407 0.5781 25.4985 9.2150 34.9088 25.9230 0.1933 15.0430 22.8897 75.7951 39.7892 6.6763 30.1691 4.4790 13.2404 4.8230 70.0383 4.0135 12.4274 7.9274 14.7743 8.6252 209.6061 0.8823 9.2256 188.7637 94.6108 105.0075 29.3228 26.5544 19.6793 40.2630 16.8611 32.7960 21.3051 20.6011 9.0158 9.1534 15.1179 42.4874 30.9735 29.8823 28.0304 9.2890 3.9391 13.3740 45.9896 25.1017 27.0420 27.2849
temp: 298.150 k
press: 1.00000 atm
elementType: 8 8 8 7 7 6 6 6 6 6 6 6 6 6 6 6 6 6 6 6 6 1 1 1 1 1 1 1 1 1 1 1 1 1 1 1 1 1 1 1 1 1 1 1 1
symmnumber: 1
zpe: 990844.6 jmol-1
zpe.correction: 0.377393 hartree
zpe.thermalcorrener: 0.400440 hartree
zpe.thermalcorrenthalpy: 0.401384 hartree
zpe.thermalcorrgfe: 0.319267 hartree
zpe.sumelectzpe: -957.666319 hartree
zpe.sumelectthermal: -957.643272 hartree
zpe.sumelectthermalent: -957.642328 hartree
zpe.sumelectthermalfe: -957.724444 hartree
dipole: 1.7826 1.8427 3.7793
dipole: 4.5669
quadrupole: -118.3255 -114.8509 -129.5849
quadrupole: -4.3962 5.0919 1.7343
quadrupole: 2.5949 6.0695 -8.6645 -4.3962 5.0919 1.7343
hfenergy: -958.0437118 hartree
pointgroup: C01 [X(C16H24N2O3)]
dipole: 0.8380921 0.394453 1.5395902 debye
polarizability: 214.6044628|-17.3085109|198.8411396|-21.1138617|-4.5844245|168.3929103 unknown
InChI: InChI=1S/C16H24N2O3/c1-3-18(4-2)16(21)14(12-15(19)20)17-11-10-13-8-6-5-7-9-13/h5-9,14,17,19H,3-4,10-12H2,1-2H3
charge 0 multiplicity 1
45 atoms
O  1.833632 1.004045 -1.780025
O  4.124273 -3.652653 -0.960297
O  2.044695 -3.73334 0.054573
N  0.464843 -1.308288 -0.56013
N  2.239736 1.642002 0.41345
C  1.785088 -0.800773 -0.128096
C  1.946468 0.685108 -0.553102
C  -0.716433 -0.55843 -0.096811
C  2.901243 -1.587095 -0.860264
C  -2.005811 -1.176236 -0.695183
C  2.362499 3.052988 -0.043233
C  2.483884 1.398815 1.856957
C  -3.246575 -0.388881 -0.303029
C  2.931946 -3.061976 -0.526184
C  3.802065 3.414106 -0.465992
C  1.217402 1.53094 2.72988
C  -4.04817 -0.779206 0.800304
C  -3.605331 0.785771 -1.01519
C  -5.176851 -0.018728 1.18417
C  -4.731984 1.549099 -0.636562
C  -5.522425 1.149666 0.466806
H  1.929795 -0.908437 0.971904
H  0.398214 -2.313971 -0.344257
H  -0.8181 -0.526157 1.018775
H  -0.629467 0.488271 -0.44419
H  3.899808 -1.162879 -0.649398
H  2.728594 -1.46939 -1.947704
H  -2.094918 -2.226017 -0.351266
H  -1.880797 -1.200824 -1.793347
H  2.02073 3.706823 0.78084
H  1.682211 3.186538 -0.900521
H  3.238571 2.138291 2.186668
H  2.945068 0.40696 2.001058
H  4.520225 3.261032 0.361085
H  4.111188 2.7918 -1.322633
H  3.856425 4.475105 -0.771755
H  0.745521 2.521097 2.597836
H  0.470637 0.762383 2.46456
H  1.474035 1.413084 3.798981
H  -3.789393 -1.688844 1.357248
H  -3.000184 1.097145 -1.876116
H  -5.787082 -0.338817 2.036754
H  -4.99694 2.449689 -1.202556
H  -6.399092 1.738416 0.760024
H  4.099456 -4.628229 -0.76013
