program: Gaussian 09
title: 000206708
version: EM64L-G09RevD.01
frameworkgroup: C1[X(C16H24ClN2O3)]
method: RPBEPBE
basis: SDD
operation: Freq
keyword: #p
keyword: freq=noraman
keyword: PBEPBE/SDD
title: #p freq=noraman PBEPBE/SDD
converged: NO YES NO NO
title: Mulliken charges:
elementType: Cl O O O N N C C C C C C C C C C C C C C C C H H H H H H H H H H H H H H H H H H H H H H H H
charge: -0.018637 -0.319862 -0.352990 -0.387827 -0.134279 -0.400280 0.022242 -0.398912 -0.510526 -0.452346 -0.294357 -0.592245 -0.451234 -0.715038 0.171356 0.115056 0.311682 -0.316199 -0.452008 -0.348162 0.427144 -0.522127 0.336087 0.280726 0.278738 0.268490 0.249932 0.264913 0.264733 0.264911 0.288866 0.270051 0.273315 0.268980 0.233214 0.248297 0.239334 0.240602 0.271630 0.377219 0.301129 0.280178 0.248724 0.246657 0.245648 0.377175
chargesum: 1.00000
title: Mulliken charges with hydrogens summed into heavy atoms:
elementType: Cl O O O N N C C C C C C C C C C C C C C C C
charge: -0.018637 -0.319862 -0.352990 -0.010652 -0.134279 -0.023061 0.358329 0.160552 0.007895 0.077300 0.259420 0.220101 0.030278 0.036527 0.171356 0.115056 0.311682 -0.015070 -0.171829 -0.348162 0.427144 0.218902
polarizability: 2.85656483e+02 1.02398019e+01 2.24037401e+02 -1.34269544e+01 -2.31152294e+00 1.29632715e+02
1716.lowfreq: -13.9899 -5.3291 -0.0026 -0.0022 -0.0018 3.4904 20.3403 28.0909 37.7988
frequency: 19.8303 27.3010 37.2524 51.0682 70.4833 80.7395 91.4812 110.3986 114.8622 136.1048 166.9095 182.7184 195.8418 209.1068 216.7687 227.0045 230.6101 253.0733 272.7408 278.5658 307.2384 321.0300 335.2029 353.7908 369.3093 372.9738 380.5091 416.6696 452.3501 457.1583 464.5577 489.6808 498.1250 569.1175 579.5557 614.9984 630.0670 636.9054 654.5666 688.1540 711.0864 711.5804 719.7384 756.0792 767.6410 781.9810 797.1750 835.7773 854.5486 877.2071 887.3321 909.1748 927.6713 938.0947 965.6301 979.2157 1003.6170 1015.8868 1026.8518 1044.1611 1047.2934 1084.7878 1097.2597 1114.6206 1117.2581 1121.0689 1136.4215 1154.5353 1161.0013 1165.7334 1190.6714 1192.3238 1213.7386 1232.1823 1233.5075 1245.2162 1249.1528 1260.7028 1293.5022 1300.3532 1307.0079 1316.1635 1330.0260 1341.1359 1357.6492 1377.9436 1394.5731 1402.9592 1408.5578 1413.9720 1433.5742 1439.8936 1450.4728 1454.5575 1469.6004 1470.8259 1471.4712 1473.9235 1479.1936 1481.7542 1484.2079 1490.0149 1496.8167 1499.6620 1507.7776 1551.7577 1579.5972 1623.2069 2989.4715 2992.8666 3001.6365 3018.1984 3035.6036 3040.7131 3046.6692 3047.1513 3054.1421 3075.2501 3086.4656 3091.0808 3091.2909 3097.3158 3104.8608 3120.8453 3128.3185 3140.4785 3148.8867 3151.3298 3168.6011 3193.2043 3410.1655 3491.8522
redmass: 3.9918 4.2430 4.2927 2.8594 4.7141 2.2285 4.4125 5.4369 3.1459 2.7715 6.1341 4.8770 2.5814 2.2538 1.4928 1.9955 3.0870 2.2288 2.1347 2.5223 2.1550 7.4552 2.2919 3.2763 3.6140 2.7674 6.7785 3.5733 3.1118 4.4485 3.2011 3.5720 1.1038 3.3422 6.3913 4.4212 6.0905 4.4528 4.9547 3.6801 1.2663 4.8018 1.8995 4.5210 1.4112 1.8280 2.2165 1.8269 1.7603 2.6363 3.0456 2.1643 1.3762 6.8442 2.5564 2.2108 2.3215 3.5249 2.7096 3.3827 2.3381 1.9391 2.0680 1.2542 1.6307 3.3730 2.4227 1.3793 1.7286 1.7737 1.5896 1.6821 1.5915 1.2791 1.2392 2.2391 1.4823 1.3053 4.4445 1.2178 1.2403 1.2583 1.3467 1.2769 1.2906 1.2732 3.7367 1.2830 1.2188 2.7576 1.1524 1.1596 1.5408 1.0791 1.0493 1.0607 1.4636 1.0710 1.0682 1.3834 1.2401 1.0841 1.0921 1.0693 2.3115 4.4348 6.4378 6.9289 1.0313 1.0620 1.0375 1.0657 1.0328 1.0611 1.0636 1.0637 1.0858 1.0991 1.1007 1.1058 1.1012 1.0980 1.1028 1.1045 1.1072 1.1024 1.1044 1.1040 1.0921 1.0916 1.0820 1.0651
irintensity: 0.3583 1.0769 2.5047 2.7264 2.7130 1.1278 4.4787 0.5397 4.7693 3.7760 4.9370 1.9174 4.0343 0.4721 0.7275 1.3904 8.4897 0.9499 3.4218 8.5433 1.8303 1.8221 0.9604 0.5545 2.2361 1.8677 3.0889 18.3366 8.1881 4.0307 1.4612 13.0258 149.1509 0.8956 8.8733 2.9584 2.5930 3.1831 60.5305 1.2899 82.6529 11.5634 4.1655 19.4060 11.6981 35.1895 9.0240 3.4818 32.8765 16.6912 5.0984 3.6397 15.6409 54.2121 12.4882 11.7276 7.8851 12.2993 30.6683 7.5469 8.2058 9.6523 5.7552 0.4476 6.8908 83.2210 7.9188 47.9830 40.9562 33.4126 251.9734 1.1554 3.7273 9.5516 3.4127 36.6044 52.1564 19.6555 187.1369 14.5357 26.4842 6.1139 1.5416 5.3784 10.6924 23.4328 69.5485 12.6045 17.5411 15.6043 44.3474 20.3426 26.8301 17.2018 18.1541 30.8307 175.9491 44.7364 31.5822 150.2473 24.7089 24.8915 3.2752 9.8934 170.7881 109.5346 366.2069 119.9019 41.9706 39.6984 8.5755 12.0606 5.2568 16.4938 8.8189 0.6864 0.7322 10.0251 1.6655 21.9013 8.9659 6.4891 9.1687 13.2179 12.2707 12.7492 5.3381 6.3701 7.2139 0.1445 197.8309 121.5054
temp: 298.150 k
press: 1.00000 atm
elementType: 17 8 8 8 7 7 6 6 6 6 6 6 6 6 6 6 6 6 6 6 6 6 1 1 1 1 1 1 1 1 1 1 1 1 1 1 1 1 1 1 1 1 1 1 1 1
symmnumber: 1
zpe: 1010373.7 jmol-1
zpe.correction: 0.384831 hartree
zpe.thermalcorrener: 0.407755 hartree
zpe.thermalcorrenthalpy: 0.408699 hartree
zpe.thermalcorrgfe: 0.331478 hartree
zpe.sumelectzpe: -1417.421413 hartree
zpe.sumelectthermal: -1417.398489 hartree
zpe.sumelectthermalent: -1417.397545 hartree
zpe.sumelectthermalfe: -1417.474766 hartree
dipole: 13.1649 3.7614 0.3440
dipole: 13.6960
quadrupole: -38.9891 -108.7448 -129.7559
quadrupole: -10.0625 0.6849 -2.0312
quadrupole: 53.5075 -16.2482 -37.2593 -10.0625 0.6849 -2.0312
hfenergy: -1417.8062444 hartree
pointgroup: C01 [X(C16H24Cl1N2O3)]
dipole: 4.8695442 -1.1700709 -1.9884047 debye
polarizability: 274.8584125|-36.8725401|147.7622898|-7.7281067|31.5996916|216.7058961 unknown
InChI: InChI=1S/C16H24ClN2O3/c1-4-19(2)7-5-6-11(19)10-18-16(21)12-8-13(17)14(20)9-15(12)22-3/h8-9,11,18,20H,4-7,10H2,1-3H3
charge 1 multiplicity 1
46 atoms
Cl -4.020416 2.208879 3.153093
O  0.586451 0.065104 1.462207
O  -1.979099 -0.438669 -1.877514
O  -5.597009 1.662712 0.570367
N  4.067962 -0.323141 0.19683
N  0.385142 -0.70184 -0.703702
C  2.784209 -0.064603 -0.670374
C  5.008703 0.798373 -0.29183
C  3.341401 0.318875 -2.060191
C  4.766399 0.912383 -1.814118
C  3.742744 -0.178467 1.704273
C  4.675739 -1.684161 -0.109706
C  1.748493 -1.224105 -0.634846
C  4.947912 -0.371715 2.629366
C  -0.151483 -0.096862 0.424647
C  -1.575517 0.344061 0.383154
C  -2.479818 0.182388 -0.71804
C  -2.066808 0.966643 1.560594
C  -3.812727 0.629259 -0.631707
C  -3.385784 1.408765 1.641838
C  -4.279661 1.247412 0.54979
C  -2.89306 -0.658647 -3.013297
H  2.321684 0.80879 -0.17993
H  6.045251 0.553413 -0.016433
H  4.703339 1.714181 0.240847
H  2.669178 1.047794 -2.540307
H  3.389684 -0.559993 -2.727163
H  5.529672 0.358387 -2.384592
H  4.834027 1.966996 -2.124878
H  3.303406 0.826657 1.818019
H  2.934357 -0.892972 1.926279
H  4.800678 -1.793067 -1.196998
H  5.657112 -1.761052 0.379088
H  4.014583 -2.475764 0.271648
H  1.853353 -1.794452 0.308107
H  1.90811 -1.91457 -1.480646
H  5.347251 -1.399711 2.613807
H  5.768961 0.336633 2.422958
H  4.609012 -0.178243 3.662185
H  -0.231132 -0.849897 -1.514683
H  -1.372521 1.079346 2.398598
H  -4.525402 0.519338 -1.451207
H  -3.738699 -1.302597 -2.713187
H  -2.287077 -1.168177 -3.775941
H  -3.262722 0.304328 -3.408333
H  -5.827683 2.07809 1.44503
