program: Gaussian 09
title: 000206702
version: EM64L-G09RevD.01
frameworkgroup: C1[X(C10H8N4S)]
method: RPBEPBE
basis: SDD
operation: Freq
keyword: #p
keyword: freq=noraman
keyword: PBEPBE/SDD
title: #p freq=noraman PBEPBE/SDD
converged: YES YES NO YES
title: Mulliken charges:
elementType: S N N N N C C C C C C C C C C H H H H H H H H
charge: 0.210326 -0.094163 0.030283 -0.002652 -0.653678 -0.176588 -0.309856 0.330348 -0.272011 -0.274444 -0.330059 0.268035 -0.398538 -0.239118 -0.212392 0.270269 0.244495 0.262238 0.261017 0.229874 0.231539 0.312765 0.312313
chargesum: 0.00000
title: Mulliken charges with hydrogens summed into heavy atoms:
elementType: S N N N N C C C C C C C C C C
charge: 0.210326 -0.094163 0.030283 -0.002652 -0.028600 -0.176588 -0.309856 0.330348 -0.001743 -0.029949 -0.067821 0.268035 -0.137521 -0.009243 0.019147
polarizability: 3.10893217e+02 -2.03700441e-01 1.47204836e+02 5.09799623e-01 8.80471678e-02 5.72715436e+01
1716.lowfreq: -4.7280 -0.0021 -0.0019 -0.0007 3.5566 5.9531 9.0674 57.4293 97.1133
frequency: 7.6864 57.4256 97.1109 146.2022 185.4512 257.1441 261.9199 282.4038 286.2548 301.4691 345.2553 368.5283 420.5356 431.6145 484.4223 525.7044 572.0125 575.0636 590.3550 634.0702 636.7122 676.0005 690.4158 709.4931 728.6460 762.0584 814.2783 828.7553 861.7308 884.8827 922.3338 943.5720 982.8591 992.8551 1015.8850 1031.2559 1038.2579 1115.9049 1166.2340 1175.9213 1178.1375 1221.9772 1244.3213 1275.5367 1367.2908 1375.1771 1379.2098 1410.7331 1433.2741 1445.0062 1562.2099 1574.8650 1617.7465 1621.5075 1650.1439 3136.6246 3151.2153 3165.7857 3177.5938 3213.4337 3237.2636 3585.6577 3722.6063
redmass: 5.1538 5.5066 5.7006 5.5338 5.6690 1.2491 4.3171 1.4551 5.5360 2.6251 6.7020 5.6248 4.7389 3.1780 9.0012 5.5022 7.2830 3.8289 3.4246 3.0360 8.8855 7.2675 5.8730 2.0383 2.8491 1.4790 1.4299 6.7936 1.3758 9.2437 4.9498 1.3803 1.3172 2.5672 2.3633 1.7973 3.4204 1.5774 1.2546 3.8304 1.7086 2.1097 1.9231 1.6856 3.9321 4.5227 6.6117 5.1495 3.0010 2.7262 7.1197 7.6214 5.7409 1.9690 2.1612 1.0857 1.0906 1.0960 1.0991 1.0970 1.0993 1.0451 1.1044
irintensity: 2.4133 2.6674 2.6928 0.1659 0.9235 104.7484 9.7723 173.9017 17.9868 34.4884 1.9565 1.8230 8.0963 9.4855 0.9760 0.0371 6.7596 7.0317 11.5760 32.5312 26.9366 3.6835 14.4903 35.0873 14.3759 83.5113 39.5299 5.4788 1.1276 98.3610 85.7164 3.0200 0.0941 10.7987 15.9502 14.0554 1.8725 18.9283 7.3293 18.5386 90.8356 50.3037 45.4217 21.7180 105.3099 6.1067 2.3328 192.5092 33.4571 12.3149 203.6834 225.0810 247.8393 14.0937 284.8525 2.0081 10.5168 19.3813 16.9521 2.7691 4.2111 113.8084 29.6094
temp: 298.150 k
press: 1.00000 atm
elementType: 16 7 7 7 7 6 6 6 6 6 6 6 6 6 6 1 1 1 1 1 1 1 1
symmnumber: 1
zpe: 433981.2 jmol-1
zpe.correction: 0.165295 hartree
zpe.thermalcorrener: 0.177868 hartree
zpe.thermalcorrenthalpy: 0.178812 hartree
zpe.thermalcorrgfe: 0.124424 hartree
zpe.sumelectzpe: -1001.861685 hartree
zpe.sumelectthermal: -1001.849112 hartree
zpe.sumelectthermalent: -1001.848168 hartree
zpe.sumelectthermalfe: -1001.902556 hartree
dipole: 2.5162 -3.3034 -0.1215
dipole: 4.1543
quadrupole: -52.7842 -90.2578 -100.5438
quadrupole: -5.1966 -0.3520 0.1940
quadrupole: 28.4111 -9.0626 -19.3486 -5.1966 -0.3520 0.1940
hfenergy: -1002.0269799 hartree
pointgroup: C01 [X(C10H8N4S1)]
dipole: -1.0032813 1.282745 0.1392223 debye
dipolederiv: -0.3371433 -0.0265104 0.0043519 -0.1986402 -0.4484668 -0.0768264 -0.013713 -0.0753501 0.048666 -1.9256371 -0.2354333 0.0082638 -0.7931289 -0.2227003 -0.0275531 -0.0514302 -0.0292327 0.0265932 -1.1856095 0.2037156 0.0489412 0.5009075 -0.6244718 -0.0823407 0.092065 -0.0728068 -0.1823011 0.6745217 0.3084012 0.0133285 0.8411707 -0.1206882 -0.0054265 0.0864979 -0.0007192 -0.1553288 -1.5812679 0.3143083 0.0406832 0.8275565 -0.2626106 0.0374746 0.0901542 0.0440516 -0.76602 2.26204 0.2149258 -0.0091479 0.2131151 1.0058328 0.1592241 -0.0206696 0.1481376 0.0684302 0.29046 -0.166376 -0.0364152 -0.3879396 -0.0631733 0.0087245 -0.065959 0.0041143 -0.0794577 0.6599618 -0.0430507 -0.0140938 0.2753384 0.0349486 -0.0067449 0.0240017 -0.0038729 0.0455873 0.2306702 0.1554426 0.004406 -0.5409512 -0.1461289 0.015852 -0.0825346 0.0086488 -0.2881776 -0.0398701 0.0674736 0.0094882 0.1590871 0.0832069 0.0289542 0.0247784 0.0322346 -0.1206718 -0.0539605 0.0262163 0.0011992 0.0235475 0.0892114 0.0355849 0.0017927 0.035141 -0.1389625 1.3672893 -0.4749124 -0.0589192 -1.3930283 0.0660371 0.013269 -0.1392873 -0.000103 0.1342597 -0.7767408 -0.1297625 -0.0038204 0.7524018 0.27073 0.026602 0.0720687 0.0407143 -0.1575897 -0.1135136 0.0339385 0.0038671 0.0441805 0.0350173 0.0314662 0.0049678 0.0316353 -0.167997 0.0211469 -0.1004799 -0.018357 -0.1840437 -0.021966 0.0249998 -0.0297434 0.0236113 -0.1600777 0.1120991 -0.0470509 -0.0027273 -0.017822 0.0157959 -0.0185063 0.0073979 -0.0206013 0.2502449 0.0853417 0.0138364 0.0036215 -0.0489524 -0.0583498 -0.0338615 -0.0056285 -0.0352305 0.1624578 0.0891408 -0.0350309 -0.0037246 0.0056822 -0.0392697 -0.0323557 0.0007078 -0.0314424 0.1648419 -0.0059791 -0.0653669 -0.0031814 -0.0454014 0.0376124 -0.0118026 -0.0056816 -0.012044 0.1846773 -0.1106855 -0.0756714 -0.0067153 -0.075432 0.0554574 -0.0158998 -0.0068663 -0.015906 0.1645964 -0.082682 0.0966003 0.0191209 0.1098389 0.0266804 -0.0229147 0.0210754 -0.0226466 0.1594957 0.1522992 -0.0264902 -0.0002011 -0.0970559 0.1478639 -0.0225341 -0.0069231 -0.0235493 0.4035954 0.2681188 -0.0087231 0.0000317 0.0295693 0.1394313 -0.0253847 0.0029292 -0.0247841 0.4031382 unknown
polarizability: 310.8177298|1.9383915|145.6345871|-3.8221733|11.8201415|58.91728 unknown
InChI: InChI=1S/C10H8N4S/c11-7-5-12-14(6-7)10-13-8-3-1-2-4-9(8)15-10/h1-6H,11H2
charge 0 multiplicity 1
23 atoms
S  0.391618 1.663963 0.252159
N  -1.715388 -0.17828 0.000246
N  0.544291 -1.015991 -0.170746
N  -2.313862 -1.444373 -0.102441
N  -5.185848 0.821384 0.136114
C  -0.325246 -0.050647 -0.005274
C  2.018684 0.870715 0.098277
C  1.867794 -0.540895 -0.116503
C  -2.668706 0.85361 0.104454
C  3.285767 1.477093 0.16836
C  3.020538 -1.34865 -0.260998
C  -3.926294 0.237567 0.068058
C  -3.643026 -1.175307 -0.05994
C  4.425919 0.652307 0.021548
C  4.292349 -0.745616 -0.190817
H  -2.386734 1.899943 0.183918
H  3.396588 2.553254 0.331895
H  2.898029 -2.423137 -0.424062
H  -4.352205 -2.000474 -0.120604
H  5.422847 1.102734 0.073368
H  5.190096 -1.362931 -0.301453
H  -5.297171 1.825289 0.229034
H  -6.020241 0.246941 0.08851
