program: Gaussian 09
title: 000206692
version: EM64L-G09RevD.01
frameworkgroup: C1[X(C8H15N3)]
method: RPBEPBE
basis: SDD
operation: Freq
keyword: #pfreq=noraman
keyword: PBEPBE/SDD
title: #p freq=noraman PBEPBE/SDD
converged: YES YES NO NO
title: Mulliken charges:
elementType: N N N C C C C C C C C H H H H H H H H H H H H H H H
charge: -0.160957 -0.206748 -0.094156 0.002007 0.344850 0.111588 -0.764314 -0.771748 -0.612415 -0.627396 -0.627778 0.233227 0.243657 0.231113 0.230264 0.248110 0.230923 0.263897 0.224325 0.225552 0.185166 0.215267 0.237226 0.185931 0.237490 0.214920
chargesum: 0.00000
title: Mulliken charges with hydrogens summed into heavy atoms:
elementType: N N N C C C C C C C C
charge: -0.160957 -0.206748 -0.094156 0.002007 0.344850 0.111588 -0.056318 -0.062451 0.101358 0.010264 0.010563
polarizability: 1.23246496e+02 3.36912027e+00 1.16399960e+02 -7.13703274e-02 -3.77440880e-02 7.65510767e+01
1716.lowfreq: -26.0744 -12.9228 -8.5592 -0.0005 -0.0005 0.0002 8.7274 38.1364 66.4700
frequency: -25.5848 37.6710 66.3799 95.6320 103.6308 135.1770 167.5490 190.0022 203.7770 206.6610 233.8604 245.7028 306.9840 312.3251 336.2311 455.6900 538.4623 555.9633 589.2928 621.8821 677.9211 730.0013 827.9744 940.8341 963.3498 1010.8875 1023.7281 1038.3978 1041.7595 1046.8232 1087.1828 1118.0469 1127.0520 1133.0136 1185.7831 1216.7918 1247.9064 1315.7850 1359.6035 1388.3552 1397.4957 1417.5915 1421.4387 1433.2238 1452.8997 1455.8304 1464.0625 1465.6010 1470.6328 1472.7309 1475.3546 1475.8496 1481.8751 1484.0491 1491.5207 1501.8128 1551.8004 2856.9406 2868.5944 2967.9436 2980.9366 2982.9052 3001.8185 3002.4542 3036.6685 3058.9834 3064.9698 3078.1543 3082.1500 3092.7700 3102.1419 3127.4792
redmass: 1.6155 1.1074 1.2736 1.6611 1.5190 2.2177 2.4255 1.2377 2.3044 1.1905 2.5133 2.4508 3.4051 3.8720 2.3853 4.3815 3.7441 3.4150 4.0932 6.2876 4.5302 5.2740 3.4829 2.5522 2.4382 2.0632 1.8496 1.4654 1.5106 1.4806 1.2289 1.3094 2.5025 1.4010 2.4760 4.6081 3.6134 3.7017 5.1463 1.2254 1.2652 1.1266 1.4872 1.2216 1.3955 1.0509 1.2637 1.0480 1.0944 1.1568 1.1005 1.1429 1.1299 1.4300 1.4633 1.9425 4.5317 1.0556 1.0568 1.0395 1.0360 1.0362 1.0757 1.0758 1.0980 1.1015 1.0979 1.0979 1.0984 1.0992 1.0952 1.0977
irintensity: 0.0315 0.0158 0.2402 0.9245 0.0398 2.1062 8.6868 1.3968 1.7013 0.1084 2.1943 7.5594 3.3473 0.1014 3.9517 1.1516 1.8493 8.7885 1.4856 0.2827 9.0902 0.9261 1.5189 18.8044 9.2222 4.6231 9.0540 1.8282 12.3865 4.0080 6.2075 0.4317 31.4448 5.8675 10.8228 15.7501 9.1918 27.7208 27.5353 22.2629 2.5613 5.1479 0.1177 8.5921 16.1138 2.8098 19.7431 0.8092 7.4432 9.9806 4.7084 9.7227 34.4341 37.1782 16.3262 7.0027 26.4943 76.7064 185.7439 39.9956 89.0697 20.2611 69.8325 53.0484 20.7483 28.8215 20.6966 18.8873 42.2851 8.3534 17.5042 4.4980
temp: 298.150 k
press: 1.00000 atm
elementType: 7 7 7 6 6 6 6 6 6 6 6 1 1 1 1 1 1 1 1 1 1 1 1 1 1 1
symmnumber: 1
zpe: 580803.4 jmol-1
zpe.correction: 0.221216 hartree
zpe.thermalcorrener: 0.234108 hartree
zpe.thermalcorrenthalpy: 0.235053 hartree
zpe.thermalcorrgfe: 0.181848 hartree
zpe.sumelectzpe: -477.201755 hartree
zpe.sumelectthermal: -477.188863 hartree
zpe.sumelectthermalent: -477.187918 hartree
zpe.sumelectthermalfe: -477.241123 hartree
dipole: -0.0735 -3.2211 0.0813
dipole: 3.2230
quadrupole: -61.6783 -66.8019 -67.2439
quadrupole: 5.2056 0.0461 0.1579
quadrupole: 3.5631 -1.5605 -2.0025 5.2056 0.0461 0.1579
hfenergy: -477.422971 hartree
pointgroup: C01 [X(C8H15N3)]
dipole: 0.0234559 -1.2468614 0.2295013 debye
dipolederiv: -0.686697 0.2233141 -0.0645414 0.2266629 -0.1938539 0.027963 -0.085812 0.0301094 -0.1010023 -0.5510709 -0.0990079 0.0122419 -0.0739305 -0.5692524 0.0112526 0.0039642 0.0116207 -0.4969165 -0.3596243 -0.1518982 0.0217359 -0.3316209 -0.2248067 -0.0148066 0.0643054 -0.0028989 -0.2310003 0.5156365 0.1621114 -0.0091789 0.3431874 -0.0682594 0.0051967 -0.0336773 -0.0036368 -0.1775106 0.3300168 -0.1702758 0.0482718 0.0884765 0.0618558 -0.019853 -0.0053035 -0.0390446 -0.0384092 -0.0266867 0.0408828 -0.0024866 -0.1361095 0.4381055 -0.1021334 0.0475815 -0.1110065 -0.015873 0.0455362 0.0075856 -0.0065775 -0.046101 -0.0548837 0.0290231 0.0069574 0.0376632 0.1221972 0.009762 -0.0181326 0.0035456 0.0857782 -0.0859486 0.0378189 -0.0252398 0.0470256 0.0847347 0.5023133 -0.1738272 0.0389499 -0.1700862 0.1441288 0.0088601 0.0403472 0.0084452 0.2240799 0.1897966 -0.010003 -0.1733634 -0.0251276 0.3566349 -0.1566711 -0.261179 -0.1916169 0.3786718 0.179086 0.0267753 0.1624528 0.0126198 0.4484723 0.1401621 0.2536921 0.1789016 0.3067304 0.0647185 0.0444634 -0.0938675 0.0140803 0.0050745 0.0274984 -0.0932394 0.1037663 -0.08927 -0.0882125 -0.1079429 0.0022646 -0.0513596 0.0731942 0.0044818 -0.0098967 -0.0003153 0.103279 0.0284266 0.1005457 0.0855143 0.0551536 -0.0390761 -0.0299078 0.0956267 -0.1000763 -0.0034151 0.0817112 0.0065028 0.0518039 0.0266856 0.0119716 0.0663496 0.0190101 0.1301532 -0.1065212 -0.0982522 0.0476702 0.001896 -0.030037 0.1403809 -0.0019268 0.01872 -0.0077469 0.0968294 0.0732346 -0.0453011 -0.0588296 -0.0005882 -0.0815231 -0.0748573 -0.0360177 -0.1336598 0.0103987 0.0421066 -0.0347846 0.0008688 -0.1427449 0.0132585 0.010072 0.020883 0.0166714 0.1279705 -0.0054347 0.0372188 0.0042568 0.1032416 0.0439693 0.0966663 -0.0886285 0.0985075 -0.1051174 -0.0198559 0.047977 -0.010793 0.1399612 -0.029702 -0.1094358 0.0585707 -0.1210823 -0.0278651 0.0413428 0.0737482 0.0152458 -0.0268574 -0.2553816 0.1941218 0.0616908 0.0674513 -0.0573615 -0.2562291 0.0138334 0.0575752 0.0228108 0.0743866 0.0373072 -0.0139938 0.0257577 0.0736191 0.1046563 -0.0563317 -0.0874644 -0.0407747 -0.0002481 -0.0988161 -0.0481374 -0.0737914 -0.0643791 0.0396633 0.071794 -0.0313569 -0.0380786 -0.3064609 -0.1284236 -0.053769 0.0066052 -0.0056117 0.0955535 -0.0331294 0.1072016 -0.0291587 0.0394162 0.0730626 0.0706002 0.0439797 -0.0939883 -0.2514976 -0.0037884 -0.0753655 0.0239167 0.0585474 -0.0330049 -0.0070552 -0.0217825 0.0857307 unknown
polarizability: 123.1297598|-2.9354042|114.7197486|2.5912202|-8.0869762|78.3480243 unknown
InChI: InChI=1S/C8H15N3/c1-6-8(10(3)4)7(2)11(5)9-6/h1-5H3
charge 0 multiplicity 1
26 atoms
N  1.752498 -0.041637 0.071638
N  -1.883915 -0.118075 -0.050679
N  1.511591 1.311846 -0.206449
C  -0.473926 0.130077 -0.05041
C  0.588108 -0.784189 0.16953
C  0.147853 1.405979 -0.2784
C  0.580702 -2.258958 0.457202
C  -0.540675 2.710281 -0.56425
C  3.133227 -0.496681 0.213294
C  -2.500486 -0.482149 1.236569
C  -2.43598 -0.816161 -1.224844
H  1.003126 -2.492678 1.454047
H  -0.453337 -2.637456 0.435918
H  1.163533 -2.830879 -0.290489
H  -0.315462 3.074217 -1.583676
H  -1.630884 2.564495 -0.477557
H  -0.225661 3.49686 0.144549
H  3.777865 0.387581 0.102517
H  3.307275 -0.950401 1.206106
H  3.39711 -1.23591 -0.565598
H  -2.325916 -1.543086 1.545518
H  -3.595655 -0.329278 1.179418
H  -2.103541 0.171734 2.031504
H  -2.245171 -1.918611 -1.231011
H  -1.99698 -0.39183 -2.143699
H  -3.532395 -0.667194 -1.265346
