program: Gaussian 09
title: 000206690
version: EM64L-G09RevD.01
frameworkgroup: C1[X(C14H19N3)]
method: RPBEPBE
basis: SDD
operation: Freq
keyword: #pfreq=noraman
keyword: PBEPBE/SDD
title: #p freq=noraman PBEPBE/SDD
converged: YES YES NO NO
title: Mulliken charges:
elementType: N N N C C C C C C C C C C C C C C H H H H H H H H H H H H H H H H H H H
charge: -0.134217 -0.111394 -0.058467 0.321790 -0.383143 -0.374849 -0.294326 -0.532845 -0.452198 0.471338 -0.664253 -0.667146 -0.437451 -0.357217 -0.216313 -0.222206 -0.243409 0.211623 0.218504 0.212850 0.214771 0.269748 0.257147 0.221269 0.253997 0.239108 0.214496 0.209348 0.240317 0.215846 0.208507 0.229712 0.257404 0.225975 0.227095 0.228589
chargesum: 0.00000
title: Mulliken charges with hydrogens summed into heavy atoms:
elementType: N N N C C C C C C C C C C C C C C
charge: -0.134217 -0.111394 -0.058467 0.321790 0.046984 0.052772 -0.024578 -0.054429 -0.198201 0.471338 -0.001301 -0.002477 -0.207739 -0.099813 0.009662 0.004889 -0.014820
polarizability: 2.12603685e+02 -1.67872985e+01 1.48710912e+02 1.48707192e+01 -1.07268626e+00 1.42249260e+02
1716.lowfreq: -11.2256 -0.0007 -0.0005 -0.0003 4.1376 7.4470 13.6295 29.5292 31.1285
frequency: 5.8789 28.8041 30.9475 49.7356 58.6187 76.3849 86.6453 157.1952 172.4503 213.9972 216.8471 256.3212 281.8391 301.9472 320.5188 350.9186 380.0116 404.8106 432.4321 463.9527 527.8185 559.4009 576.4144 609.4015 618.4306 637.0922 700.8699 704.5478 728.2909 773.4693 774.7269 784.6830 785.7299 805.0046 856.7350 866.3299 908.4853 919.3826 943.2492 977.1098 979.9608 983.9065 990.3121 999.3482 1026.3175 1029.9034 1071.3015 1079.8876 1083.1270 1094.6643 1130.6367 1153.4126 1172.1250 1186.7927 1189.4783 1207.3103 1221.6103 1228.6154 1292.6680 1300.4104 1309.9307 1337.7190 1343.8773 1346.9858 1358.8786 1368.1678 1379.3407 1385.0519 1388.4969 1408.7190 1413.4327 1443.3353 1460.5659 1464.2976 1467.1346 1468.3128 1479.0161 1485.3450 1485.9865 1491.9183 1596.3891 1606.6562 1615.7706 2960.4145 2973.8112 2978.6333 2980.4060 2992.4870 3022.8159 3031.0266 3059.2699 3074.5329 3075.9204 3088.4989 3089.7917 3113.7706 3124.4087 3135.6311 3146.8784 3163.2250 3223.7067 3235.9428
redmass: 3.6416 3.9017 4.0069 3.8350 3.0336 3.2908 3.1865 2.1471 4.6717 1.5035 1.2088 1.8074 4.0503 2.9829 2.5977 3.6617 2.4188 2.8197 3.3850 3.1505 2.9392 3.3540 4.1594 4.1816 4.7431 2.2420 2.1167 2.2084 1.7061 1.6076 1.6368 1.6082 1.1584 3.8988 1.2471 2.3617 1.4416 2.2014 2.5570 3.9329 1.4127 2.3687 5.6918 1.3699 2.2689 2.5098 2.1039 1.7742 1.6181 1.6302 1.9989 1.4429 1.0555 1.2745 1.5237 2.7344 2.0793 1.9632 1.4309 1.5800 1.5547 1.7739 1.4477 1.4775 1.3328 2.5254 1.2150 1.2422 4.6646 4.2265 2.9247 2.0961 1.1766 1.0528 1.0671 1.0575 1.0635 2.1028 1.0839 1.1083 6.1158 6.1129 6.0257 1.0628 1.0592 1.0369 1.0366 1.0623 1.1007 1.1002 1.0989 1.0995 1.0992 1.1010 1.1008 1.0873 1.0861 1.0913 1.0962 1.1015 1.0961 1.0987
irintensity: 0.0387 1.3795 0.9359 1.6678 0.1739 0.1826 0.6825 0.4084 1.8301 0.5868 0.1067 1.5585 0.4980 1.1749 2.2204 3.6363 0.4664 0.3056 9.3628 6.8199 2.5738 5.6775 3.8110 6.7478 5.0075 24.3053 21.1379 23.5725 95.2036 24.6053 19.8938 12.8745 5.2456 5.3673 0.0486 5.9705 2.8903 6.5002 6.4210 8.5079 0.6205 6.2035 0.3290 1.4801 14.4560 24.0269 14.2856 20.2788 10.0251 16.4845 4.7655 27.6292 0.2509 19.6674 21.0171 9.5919 9.2733 4.9831 12.7611 9.6312 35.1362 7.1900 20.5474 55.6901 44.5667 11.9066 19.4246 23.2237 9.7466 9.8148 112.2994 7.4711 46.1193 11.1749 2.3781 5.4739 0.6277 13.4250 18.5504 3.0051 4.5215 254.8727 3.4342 59.7722 34.3371 41.6223 28.0064 44.4928 7.9795 30.3573 3.2438 49.0885 46.5722 9.8092 79.1160 8.9074 0.2111 13.4644 36.9536 24.4957 5.6944 5.7640
temp: 298.150 k
press: 1.00000 atm
elementType: 7 7 7 6 6 6 6 6 6 6 6 6 6 6 6 6 6 1 1 1 1 1 1 1 1 1 1 1 1 1 1 1 1 1 1 1
symmnumber: 1
zpe: 797584.5 jmol-1
zpe.correction: 0.303784 hartree
zpe.thermalcorrener: 0.320773 hartree
zpe.thermalcorrenthalpy: 0.321717 hartree
zpe.thermalcorrgfe: 0.255087 hartree
zpe.sumelectzpe: -707.841222 hartree
zpe.sumelectthermal: -707.824233 hartree
zpe.sumelectthermalent: -707.823289 hartree
zpe.sumelectthermalfe: -707.889918 hartree
dipole: 0.6437 2.7174 -0.9773
dipole: 2.9587
quadrupole: -88.3325 -106.8971 -96.9484
quadrupole: 0.4325 4.3693 1.0501
quadrupole: 9.0602 -9.5044 0.4443 0.4325 4.3693 1.0501
hfenergy: -708.1450058 hartree
pointgroup: C01 [X(C14H19N3)]
dipole: 0.3443364 -1.1116479 0.0259866 debye
polarizability: 207.7748484|25.2505348|152.3785587|-12.7369063|-1.1207836|143.4104502 unknown
InChI: InChI=1S/C14H19N3/c1-3-16(4-2)14-10-15-17(12-14)11-13-8-6-5-7-9-13/h5-10,12H,3-4,11H2,1-2H3
charge 0 multiplicity 1
36 atoms
N  3.06251 -0.312314 -0.268749
N  -0.108812 1.016288 0.854796
N  0.429589 2.182384 0.339583
C  1.916011 0.406261 0.077513
C  4.173428 0.357035 -0.960839
C  3.178683 -1.730915 0.09629
C  0.746363 -0.073841 0.713896
C  -1.453299 1.038006 1.438992
C  1.662049 1.808916 -0.129597
C  -2.474021 0.206108 0.664487
C  5.143298 1.107549 -0.014411
C  2.487315 -2.692066 -0.902903
C  -3.384525 -0.631216 1.352788
C  -2.546779 0.289608 -0.749289
C  -4.359648 -1.371081 0.643768
C  -3.516217 -0.45126 -1.459052
C  -4.427778 -1.282699 -0.764868
H  4.734321 -0.406829 -1.532898
H  3.762913 1.063571 -1.709537
H  4.253557 -1.985633 0.168611
H  2.754869 -1.880716 1.110839
H  0.457022 -1.07075 1.034434
H  -1.743707 2.103872 1.445464
H  -1.409738 0.693982 2.490149
H  2.305984 2.562207 -0.578928
H  4.607668 1.882324 0.561822
H  5.607233 0.409209 0.705754
H  5.951181 1.598167 -0.589868
H  1.414678 -2.44957 -1.002232
H  2.94675 -2.610999 -1.904622
H  2.577113 -3.741792 -0.564435
H  -3.331544 -0.707266 2.446502
H  -1.837581 0.931212 -1.285318
H  -5.058746 -2.016053 1.188104
H  -3.563785 -0.380635 -2.551693
H  -5.180358 -1.856761 -1.317058
