program: Gaussian 09
title: 000206685
version: EM64L-G09RevD.01
frameworkgroup: C1[X(C11H14N4)]
method: RPBEPBE
basis: SDD
operation: Freq
keyword: #pfreq=noraman
keyword: PBEPBE/SDD
title: #p freq=noraman PBEPBE/SDD
converged: YES YES NO NO
title: Mulliken charges:
elementType: N N N N C C C C C C C C C C C H H H H H H H H H H H H H H
charge: -0.382234 -0.183445 -0.048465 -0.017950 -0.041391 0.296248 -0.716057 -0.672663 -0.355799 -0.408974 0.476684 -0.291378 -0.307032 -0.340441 -0.326919 0.210587 0.284185 0.223089 0.202263 0.237367 0.240354 0.211872 0.207043 0.253287 0.264331 0.223158 0.282932 0.237676 0.241671
chargesum: 0.00000
title: Mulliken charges with hydrogens summed into heavy atoms:
elementType: N N N N C C C C C C C C C C C
charge: -0.098049 -0.183445 -0.048465 -0.017950 0.169195 0.296248 -0.053338 -0.013393 -0.102511 -0.144643 0.476684 -0.068220 -0.024100 -0.102765 -0.085249
polarizability: 2.63685123e+02 6.14208046e+00 1.38739614e+02 4.71510995e+00 6.59437896e+00 7.76331501e+01
1716.lowfreq: -0.0001 0.0002 0.0005 2.1718 2.4900 13.7175 36.0144 42.9490 80.3840
frequency: 35.9659 42.2330 80.3182 88.3344 96.3450 173.8668 211.0527 217.4624 246.2360 260.3838 302.7696 323.1832 360.5717 375.0275 376.9902 432.4553 453.9166 525.5295 528.1802 595.8032 640.7368 659.5216 675.2090 708.3998 736.8145 737.3385 807.0679 818.7202 837.8940 868.6912 919.8500 923.8064 939.9816 952.2914 955.9148 957.7706 979.6608 1007.7527 1032.1643 1051.5054 1081.0357 1132.6806 1151.2097 1174.4957 1184.5575 1215.0706 1233.4341 1253.0678 1305.6554 1314.0568 1329.7617 1335.4452 1371.2591 1378.8609 1379.6720 1397.2348 1402.3079 1413.3782 1460.6089 1465.9476 1467.0070 1480.8163 1486.2681 1491.1086 1560.0095 1585.6036 1621.3390 2974.8920 2976.9305 2980.6300 3069.5882 3078.1811 3083.1818 3096.7478 3131.0130 3139.1465 3169.5580 3195.8501 3226.0347 3245.3399 3561.3550
redmass: 4.5737 3.1818 3.6331 3.7552 4.9711 3.5527 1.0295 4.7885 1.5540 2.1068 1.2008 5.6987 2.9318 2.6392 3.1710 4.5248 2.6515 3.7078 3.6533 1.9733 3.9222 6.9856 6.2566 2.2821 3.6776 3.7419 1.4129 1.4721 2.5796 1.2662 1.2545 6.1675 1.5199 1.3976 2.5303 4.8740 1.4096 2.0761 4.2992 1.9648 1.6159 2.1881 1.8703 2.6743 1.9366 1.4213 2.1656 1.6255 2.1872 2.8369 1.4358 1.4267 3.5191 2.1867 1.2689 1.2343 3.4673 2.4025 1.4127 1.0687 1.0532 1.2920 1.1227 1.8439 7.8704 5.8314 6.9314 1.0570 1.0474 1.0523 1.0981 1.0988 1.0999 1.1001 1.0888 1.0915 1.0954 1.0950 1.0966 1.0983 1.0766
irintensity: 0.6256 0.1061 1.0701 0.7046 3.1806 2.3284 0.4679 3.7129 0.4457 0.1166 87.1725 1.5593 1.0100 4.3949 33.7206 4.0069 6.8666 9.7497 9.6778 8.6983 23.0020 0.5996 48.1266 28.8164 1.9491 2.4947 12.2653 94.6968 1.3826 8.2531 7.1457 45.9822 4.2568 0.7154 9.6156 19.6648 1.3382 13.3498 11.9433 1.6209 3.3998 13.6994 28.3247 15.6529 107.1635 38.6646 1.5998 46.1657 5.6187 3.9938 11.3389 5.2418 30.1597 41.1798 19.6690 50.7505 244.9834 17.3151 25.0849 6.9044 4.7632 63.7798 41.5761 84.3744 36.7634 497.8839 206.4426 22.2167 21.2665 35.1845 7.5937 74.8671 35.1391 38.0822 25.7262 24.1781 12.9586 1.0487 3.7988 7.5061 28.0843
temp: 298.150 k
press: 1.00000 atm
elementType: 7 7 7 7 6 6 6 6 6 6 6 6 6 6 6 1 1 1 1 1 1 1 1 1 1 1 1 1 1
symmnumber: 1
zpe: 619295.1 jmol-1
zpe.correction: 0.235877 hartree
zpe.thermalcorrener: 0.249951 hartree
zpe.thermalcorrenthalpy: 0.250895 hartree
zpe.thermalcorrgfe: 0.194219 hartree
zpe.sumelectzpe: -645.445510 hartree
zpe.sumelectthermal: -645.431436 hartree
zpe.sumelectthermalent: -645.430492 hartree
zpe.sumelectthermalfe: -645.487169 hartree
dipole: -5.9438 1.9987 0.4031
dipole: 6.2838
quadrupole: -96.3275 -80.3918 -94.0626
quadrupole: -1.7319 -0.7674 2.1377
quadrupole: -6.0669 9.8689 -3.8020 -1.7319 -0.7674 2.1377
hfenergy: -645.6813874 hartree
pointgroup: C01 [X(C11H14N4)]
dipole: 2.3338332 0.8007428 -0.1551263 debye
polarizability: 263.7339965|-5.3206856|138.6312432|5.2176602|-6.7401727|77.6926475 unknown
InChI: InChI=1S/C11H14N4/c1-9(2)14-10-7-13-15(8-10)11-3-5-12-6-4-11/h3-9,14H,1-2H3
charge 0 multiplicity 1
29 atoms
N  2.953274 0.788823 0.142932
N  -0.544736 -0.128036 0.093868
N  0.009619 -1.392574 0.292773
N  -4.794847 0.26782 -0.140004
C  4.194257 -0.010784 0.156999
C  1.68441 0.218466 0.135035
C  5.364908 0.892893 0.5932
C  4.480287 -0.689537 -1.208607
C  0.441936 0.862678 -0.006794
C  1.351318 -1.176831 0.315108
C  -1.952265 0.01293 0.015009
C  -2.558431 1.279188 -0.186738
C  -2.790264 -1.125033 0.138537
C  -3.96626 1.347775 -0.255597
C  -4.184121 -0.94355 0.054628
H  4.066387 -0.803655 0.922319
H  3.040658 1.772339 -0.111912
H  6.305864 0.317143 0.630282
H  5.509699 1.721031 -0.128407
H  5.179948 1.327253 1.591348
H  3.61229 -1.283096 -1.546384
H  5.353027 -1.364955 -1.136111
H  4.695597 0.071355 -1.981794
H  0.207523 1.912073 -0.155704
H  2.020362 -2.022791 0.459548
H  -1.969738 2.194713 -0.289504
H  -2.347646 -2.110396 0.294793
H  -4.46019 2.313906 -0.410895
H  -4.855962 -1.804249 0.146373
