program: Gaussian 09
title: 000206683
version: EM64L-G09RevD.01
frameworkgroup: C1[X(C11H14N4)]
method: RPBEPBE
basis: SDD
operation: Freq
keyword: #pfreq=noraman
keyword: PBEPBE/SDD
title: #p freq=noraman PBEPBE/SDD
converged: YES YES NO NO
title: Mulliken charges:
elementType: N N N N C C C C C C C C C C C H H H H H H H H H H H H H H
charge: -0.381756 -0.187292 -0.052515 -0.003366 -0.041952 0.297163 -0.715841 -0.673568 -0.353351 -0.413142 0.430898 -0.306435 -0.419548 -0.159639 -0.361408 0.209885 0.283378 0.237411 0.202111 0.222029 0.206804 0.211022 0.240516 0.255392 0.263091 0.294308 0.241528 0.231681 0.242596
chargesum: 0.00000
title: Mulliken charges with hydrogens summed into heavy atoms:
elementType: N N N N C C C C C C C C C C C
charge: -0.098378 -0.187292 -0.052515 -0.003366 0.167933 0.297163 -0.054289 -0.015226 -0.097960 -0.150051 0.430898 -0.012127 -0.178021 0.072043 -0.118811
polarizability: 2.66482971e+02 3.99601082e+00 1.35173846e+02 -4.65574320e+00 -6.14038586e+00 7.72743632e+01
1716.lowfreq: 0.0007 0.0007 0.0009 3.1255 5.2792 14.5807 35.4822 38.1436 79.3945
frequency: 35.1791 37.7144 79.3059 88.1233 95.8382 172.7470 210.6057 211.1607 246.2545 262.0560 301.7016 318.1325 363.5015 375.3555 402.8576 428.8130 454.3111 508.6780 528.2609 599.5860 608.4783 640.1291 698.1715 707.8528 717.9264 741.8356 803.0257 815.9207 837.5694 888.8190 919.5971 923.0225 932.6285 939.6773 956.3509 983.7616 993.8489 1007.5002 1017.8447 1046.2747 1105.9657 1132.5573 1150.7355 1173.1709 1181.2190 1202.6411 1228.2198 1256.2752 1308.3937 1320.6875 1329.8299 1336.8199 1367.4438 1377.3353 1379.0552 1395.1381 1397.0064 1422.4531 1460.3956 1465.7485 1466.9663 1480.7268 1486.3218 1492.1015 1554.9833 1587.0028 1618.7143 2974.4802 2976.3873 2980.2057 3069.1245 3077.6399 3082.9296 3096.4429 3135.1863 3138.2969 3160.8495 3189.1418 3226.0905 3244.2633 3560.6587
redmass: 4.2163 3.6279 3.4606 3.7836 4.5808 3.5985 1.2477 2.2548 1.4232 2.2850 1.2055 5.1764 2.9132 3.2023 3.2700 4.6425 2.6387 4.3751 3.9463 2.1160 7.7826 3.9281 5.8418 2.2318 1.9340 4.5875 1.4090 1.5995 2.5856 1.4282 1.2560 7.0353 1.4369 1.5073 2.1854 4.3596 1.3459 2.8416 3.1939 2.2413 1.5165 2.1854 1.8245 2.3892 1.8060 1.5531 2.5441 1.6572 1.6059 6.7845 1.4267 1.3412 3.5070 2.2047 1.2263 3.0750 1.2574 2.3490 1.4442 1.0672 1.0527 1.2824 1.1069 2.0016 6.3170 6.1187 6.8636 1.0589 1.0469 1.0509 1.0981 1.0987 1.0999 1.1001 1.0879 1.0908 1.0955 1.0966 1.0965 1.0985 1.0766
irintensity: 4.4526 0.5796 1.7620 1.2330 1.2567 3.9331 0.5324 0.3419 1.0106 0.7623 90.1510 0.6082 1.7710 37.7959 0.9880 3.8974 4.8576 0.7688 4.4594 12.5159 2.9041 16.4723 14.5350 0.9547 71.6440 0.4880 25.0843 62.9483 1.1727 5.0787 7.1162 59.6938 1.6412 4.5440 4.7312 9.3851 2.5272 0.8465 4.8735 6.7002 22.8749 13.7158 27.8231 2.3543 106.6757 28.1254 10.8054 37.8651 5.0037 0.7637 10.2631 10.6740 17.4842 19.8295 21.4540 203.8857 12.7170 113.3133 43.1645 7.7420 5.0917 87.9274 45.9806 157.7795 11.4861 159.9839 260.1114 22.1285 21.5938 36.0946 6.7439 76.9578 35.0942 38.2670 28.2552 7.6704 26.8513 2.6520 3.8841 8.0444 26.2305
temp: 298.150 k
press: 1.00000 atm
elementType: 7 7 7 7 6 6 6 6 6 6 6 6 6 6 6 1 1 1 1 1 1 1 1 1 1 1 1 1 1
symmnumber: 1
zpe: 619007.8 jmol-1
zpe.correction: 0.235768 hartree
zpe.thermalcorrener: 0.249874 hartree
zpe.thermalcorrenthalpy: 0.250819 hartree
zpe.thermalcorrgfe: 0.193959 hartree
zpe.sumelectzpe: -645.443836 hartree
zpe.sumelectthermal: -645.429729 hartree
zpe.sumelectthermalent: -645.428785 hartree
zpe.sumelectthermalfe: -645.485645 hartree
dipole: 3.9859 0.0483 0.2120
dipole: 3.9918
quadrupole: -77.5192 -87.8041 -94.2288
quadrupole: -11.2157 1.5716 -1.0141
quadrupole: 8.9982 -1.2867 -7.7114 -11.2157 1.5716 -1.0141
hfenergy: -645.6796035 hartree
pointgroup: C01 [X(C11H14N4)]
dipole: 1.5684957 -0.004318 -0.0794705 debye
polarizability: 266.5217609|-2.7368434|135.0957711|5.1915047|-6.1711359|77.3136479 unknown
InChI: InChI=1S/C11H14N4/c1-9(2)14-10-6-13-15(8-10)11-4-3-5-12-7-11/h3-9,14H,1-2H3
charge 0 multiplicity 1
29 atoms
N  2.939756 0.791816 0.149087
N  -0.554031 -0.141519 0.097403
N  0.004344 -1.403295 0.295583
N  -3.926998 1.428579 -0.266565
C  4.184235 -0.001665 0.157125
C  1.673718 0.212826 0.139782
C  5.352223 0.906166 0.591924
C  4.469921 -0.67669 -1.210659
C  0.427922 0.852383 -0.002188
C  1.34701 -1.182495 0.318544
C  -1.964358 -0.006442 0.017538
C  -2.796782 -1.148761 0.139446
C  -2.578039 1.259563 -0.183973
C  -4.191215 -0.975518 0.054459
C  -4.718285 0.322651 -0.148388
H  4.062133 -0.796888 0.921001
H  3.02056 1.773788 -0.113939
H  5.167901 1.337256 1.59159
H  5.490699 1.736964 -0.127891
H  6.29611 0.334849 0.624588
H  4.680727 0.086661 -1.98273
H  5.345275 -1.349197 -1.141739
H  3.603005 -1.272415 -1.547434
H  0.188815 1.900975 -0.150231
H  2.01893 -2.026165 0.462643
H  -2.336653 -2.127057 0.295232
H  -1.982049 2.17301 -0.283931
H  -4.863717 -1.834475 0.144041
H  -5.797758 0.493993 -0.219422
