program: Gaussian 09
title: 000206671
version: EM64L-G09RevD.01
frameworkgroup: C1[X(C12H14N2O3)]
method: RPBEPBE
basis: SDD
operation: Freq
keyword: #p
keyword: freq=noraman
keyword: PBEPBE/SDD
title: #p freq=noraman PBEPBE/SDD
converged: YES YES NO NO
title: Mulliken charges:
elementType: O O O N N C C C C C C C C C C C C H H H H H H H H H H H H H H
charge: -0.216911 -0.223163 -0.254142 -0.077286 -0.399118 -0.165183 -0.387059 0.159521 -0.693118 0.233537 -0.421846 0.459826 -0.429188 -0.349519 -0.220383 -0.218500 -0.231426 0.264784 0.245553 0.238361 0.259146 0.219563 0.211980 0.357271 0.207893 0.240800 0.229986 0.272466 0.227419 0.229005 0.229730
chargesum: 0.00000
title: Mulliken charges with hydrogens summed into heavy atoms:
elementType: O O O N N C C C C C C C C C C C C
charge: -0.216911 -0.223163 -0.254142 -0.077286 -0.041847 0.099600 0.096856 0.159521 -0.002429 0.233537 0.026847 0.459826 -0.199202 -0.077053 0.007036 0.010505 -0.001696
polarizability: 2.25688240e+02 6.48770818e-01 1.46094815e+02 -8.91338865e+00 -1.04761293e+01 8.97033574e+01
1716.lowfreq: -4.6084 -2.1722 -0.0008 -0.0008 -0.0003 7.7092 11.4334 30.9312 36.7404
frequency: 10.3590 30.7792 36.7052 68.9647 93.3074 106.1246 157.8451 172.0566 188.2255 218.9645 267.5341 282.8721 314.9553 347.0076 365.8763 379.0853 403.2693 408.6095 460.3334 495.2051 581.3375 583.6546 616.7447 643.0932 674.3835 700.9401 716.0942 724.2597 753.3958 761.0020 794.4423 829.0159 856.8314 879.7154 913.3525 930.2194 952.0802 980.1316 984.3012 990.4602 1000.6395 1021.8062 1026.4706 1087.6406 1089.0452 1108.2153 1150.0552 1161.8793 1172.8293 1176.8341 1187.5500 1208.2532 1226.3618 1230.3424 1269.6075 1312.0129 1325.6072 1335.6371 1349.5259 1366.8820 1378.5262 1387.5596 1396.8010 1441.5887 1468.6984 1473.9652 1479.8871 1485.8358 1489.9838 1595.5422 1616.4411 1635.2131 1649.2955 2961.6374 2977.3745 2996.1165 2999.4065 3073.7372 3081.6570 3090.1575 3111.8819 3119.2136 3128.1494 3139.8151 3151.1241 3165.2829 3516.2158
redmass: 5.2014 3.9631 6.3338 5.1183 4.6605 4.4923 4.5548 1.1439 3.2889 4.2707 3.1705 4.2434 4.3762 3.0359 7.2291 3.8381 2.8170 6.2605 7.3989 3.6941 4.2610 5.6961 6.3215 3.3798 3.7272 2.2112 3.6703 4.4919 1.7962 1.7467 3.4696 4.1522 1.2534 4.1164 1.4610 1.5271 1.6834 1.4301 1.6696 5.6764 1.3403 3.1653 2.1855 1.5848 1.8164 3.2268 2.0900 5.6031 1.0702 1.1077 1.1170 1.6319 2.0613 2.4461 1.4515 1.6328 1.2784 2.8823 1.3363 1.7494 1.8198 8.2455 1.2366 2.1930 1.0478 1.1112 1.0561 2.3985 1.0920 6.1473 6.0893 10.8352 5.4380 1.0724 1.0774 1.0364 1.0585 1.1071 1.0958 1.1000 1.0993 1.0868 1.0871 1.0920 1.0967 1.1017 1.0767
irintensity: 1.2115 0.8862 0.2790 0.9697 1.2830 1.2056 6.6740 0.6069 2.1908 3.5056 2.5976 13.1248 4.9931 8.0434 11.0576 7.4336 0.8788 16.1905 1.0972 13.3092 1.9251 2.7772 0.3856 6.9450 20.4328 29.5724 43.8590 3.6163 17.3032 159.4059 14.0198 34.1353 0.7642 46.8967 4.1008 1.5944 8.2181 0.6290 2.0402 0.1939 0.2301 3.3922 7.5278 12.5040 0.6849 3.2272 5.2480 25.3654 0.4084 4.2977 7.6103 187.3034 219.4179 0.3361 10.4382 61.3044 4.8692 72.6758 23.2494 0.5002 70.4769 1.5070 49.3529 11.7876 10.1414 4.8698 10.6931 8.0320 23.5228 1.5960 0.1772 215.4861 440.3729 16.9256 31.0799 27.4456 38.2428 10.3632 4.1976 35.6471 10.7171 6.1755 1.2359 17.2523 27.7127 25.0210 51.7062
temp: 298.150 k
press: 1.00000 atm
elementType: 8 8 8 7 7 6 6 6 6 6 6 6 6 6 6 6 6 1 1 1 1 1 1 1 1 1 1 1 1 1 1
symmnumber: 1
zpe: 642944.0 jmol-1
zpe.correction: 0.244884 hartree
zpe.thermalcorrener: 0.260665 hartree
zpe.thermalcorrenthalpy: 0.261609 hartree
zpe.thermalcorrgfe: 0.198893 hartree
zpe.sumelectzpe: -799.575316 hartree
zpe.sumelectthermal: -799.559535 hartree
zpe.sumelectthermalent: -799.558591 hartree
zpe.sumelectthermalfe: -799.621307 hartree
dipole: 1.3639 -3.5662 0.5825
dipole: 3.8623
quadrupole: -105.6026 -95.1872 -99.1767
quadrupole: 5.4207 -0.1623 -3.6796
quadrupole: -5.6138 4.8017 0.8122 5.4207 -0.1623 -3.6796
hfenergy: -799.8202004 hartree
pointgroup: C01 [X(C12H14N2O3)]
dipole: 0.5535775 -1.3849444 0.290723 debye
polarizability: 225.8235317|1.5663763|145.1899682|-7.4119622|-12.8117676|90.4729129 unknown
InChI: InChI=1S/C12H14N2O3/c1-9-7-14(12(16)13-11(9)15)17-8-10-5-3-2-4-6-10/h2-6,9,13H,7-8H2,1H3
charge 0 multiplicity 1
31 atoms
O  0.345487 -0.435081 -0.265076
O  -5.071235 0.67733 0.04603
O  -0.643942 2.12284 0.1693
N  -1.049394 -0.202226 0.080587
N  -2.845575 1.329906 0.046693
C  -3.349467 -1.09585 0.195448
C  -1.949311 -1.250066 -0.439983
C  -3.85544 0.351613 0.075513
C  -4.361921 -2.091467 -0.402589
C  -1.431016 1.143125 0.085317
C  1.204456 -0.364112 0.980062
C  2.627168 -0.240089 0.496893
C  3.562959 -1.284027 0.695406
C  3.034325 0.945939 -0.168394
C  4.895741 -1.144419 0.244445
C  4.362132 1.082251 -0.625377
C  5.29659 0.03881 -0.417208
H  -3.253246 -1.287904 1.285207
H  -1.515705 -2.226779 -0.171139
H  -2.015459 -1.196731 -1.547308
H  -5.364502 -1.908235 0.01631
H  -4.431018 -1.974904 -1.499067
H  -4.06506 -3.13145 -0.178968
H  -3.145251 2.310833 0.049592
H  1.037148 -1.278661 1.579362
H  0.885508 0.529072 1.544654
H  3.250414 -2.205553 1.202087
H  2.300301 1.744295 -0.327366
H  5.61612 -1.954121 0.40553
H  4.671367 1.99882 -1.139916
H  6.328824 0.147743 -0.768848
