program: Gaussian 09
title: 000206666
version: EM64L-G09RevD.01
frameworkgroup: C1[X(C19H23N)]
method: RPBEPBE
basis: SDD
operation: Freq
keyword: #pfreq=noraman
keyword: PBEPBE/SDD
title: #p freq=noraman PBEPBE/SDD
converged: YES YES NO NO
title: Mulliken charges:
elementType: N C C C C C C C C C C C C C C C C C C C H H H H H H H H H H H H H H H H H H H H H H H
charge: -0.114256 -0.157243 -0.360760 -0.349999 -0.407200 -0.407353 -0.398745 -0.659226 0.460464 0.514380 -0.438036 -0.392094 -0.402095 -0.422076 -0.225108 -0.240213 -0.246505 -0.229608 -0.234981 -0.245041 0.208855 0.241684 0.171029 0.164511 0.215138 0.205612 0.192919 0.191037 0.202776 0.188696 0.213501 0.220701 0.232268 0.235852 0.263939 0.240114 0.229129 0.222251 0.221748 0.224501 0.222927 0.221415 0.225096
chargesum: 0.00000
title: Mulliken charges with hydrogens summed into heavy atoms:
elementType: N C C C C C C C C C C C C C C C C C C C
charge: -0.114256 0.051612 0.051954 0.029649 -0.008670 -0.013540 0.003452 -0.206258 0.460464 0.514380 -0.202184 -0.128154 -0.161981 -0.192947 -0.002857 -0.018465 -0.022005 -0.006681 -0.013566 -0.019946
polarizability: 2.35459153e+02 1.61829025e+01 2.01281593e+02 1.69021600e+01 -1.97066938e+01 1.62420425e+02
1716.lowfreq: -10.6118 -8.2217 -0.0008 -0.0006 -0.0005 5.2105 21.0883 30.7141 35.9035
frequency: 20.1918 30.2822 35.6489 48.1133 55.4840 76.1429 106.1402 155.9800 186.2979 220.1819 225.1922 255.0671 293.2134 305.5091 345.9250 383.2217 392.2002 401.6264 405.0495 444.5048 461.1845 503.5460 536.9828 558.6851 594.2968 610.9965 617.1256 618.3628 701.8417 706.4847 745.0178 757.0901 771.1285 783.9819 802.6391 834.5196 849.3164 852.7884 857.9945 864.5137 906.2378 916.9865 924.8585 951.8774 960.0255 971.7382 980.0478 986.1660 990.1365 991.1575 991.6931 995.0534 1017.6837 1026.2374 1029.5237 1047.0989 1071.9987 1080.0661 1086.6963 1097.7941 1120.9474 1144.1591 1150.2659 1163.4170 1169.8373 1171.3339 1183.0800 1186.5964 1199.1053 1215.9571 1228.4864 1255.5021 1269.1634 1274.0277 1287.1226 1303.4895 1316.4943 1326.7248 1332.2494 1338.2878 1343.6446 1351.4523 1358.9766 1379.4941 1385.3854 1389.0964 1440.6607 1441.0402 1452.2111 1461.0587 1464.3272 1464.6479 1473.4301 1478.4664 1480.2760 1484.2580 1592.9817 1593.3844 1611.6347 1614.4910 2814.5802 2820.6182 2834.2341 2966.8381 2982.8673 2985.2516 3001.3308 3032.7006 3042.3196 3051.5107 3055.1792 3058.9768 3067.3296 3108.9361 3115.9210 3120.2169 3120.9515 3131.6436 3134.1054 3142.8651 3143.9650 3159.8487 3160.6438
redmass: 3.8290 3.7822 3.2941 4.5064 3.3131 4.0851 3.2751 4.6653 3.3790 2.1755 3.9637 3.5955 2.3492 3.8006 2.2388 1.9429 3.0158 2.8015 2.8331 2.9220 2.8433 3.1252 2.4060 3.5232 3.9631 3.4155 5.4840 5.5651 1.7901 1.7475 2.1401 2.2184 3.0405 2.6097 1.5152 3.4456 1.2523 1.4127 1.2575 2.7095 2.0039 1.7563 1.4550 1.5608 1.6147 1.4031 1.4479 2.5826 3.4317 4.6865 1.6502 1.3534 2.8570 2.1746 2.1812 2.1989 1.6150 1.5112 1.7050 2.2588 2.6238 2.0279 1.3584 1.3183 1.0570 1.0610 1.1117 1.1178 2.1081 2.4053 1.9315 1.2506 1.3092 1.2379 1.2559 1.4096 1.3307 1.2690 1.3077 1.3742 1.4921 1.5118 1.4861 2.3047 4.3673 2.6463 2.1457 2.1491 1.0883 1.0877 1.0974 1.0845 1.1821 1.1592 2.1377 1.9786 6.0534 6.1393 6.1729 6.1701 1.0725 1.0770 1.0737 1.0623 1.0611 1.0611 1.0584 1.0964 1.1024 1.1014 1.0895 1.0911 1.0969 1.0872 1.0850 1.0858 1.0872 1.0913 1.0915 1.0960 1.0960 1.1014 1.1015
irintensity: 0.0915 0.0242 0.3922 0.0512 0.0063 0.4351 0.4176 0.4554 0.8244 0.8458 0.0582 0.4470 1.7349 0.3932 0.5775 1.8493 0.8794 0.0588 0.1862 0.7450 0.7912 2.9779 13.3869 18.9550 3.4951 5.5372 0.3271 0.5390 58.6703 45.1291 36.7390 6.7873 10.1346 34.2447 2.2519 4.6743 0.4194 5.2145 0.4125 12.1092 1.3191 3.1618 12.4472 1.2274 5.6655 0.1470 0.4665 24.5707 0.2231 0.5665 1.8000 0.5362 0.1840 5.4517 11.1549 12.0399 13.4808 12.3968 17.6879 31.1436 6.6096 13.5995 9.3699 3.5644 0.0991 0.2765 0.5228 0.6313 1.9508 5.3979 8.2394 5.7828 5.6165 8.9731 6.0057 6.0516 19.2682 1.1520 1.5602 5.9120 4.3483 1.4765 3.2905 0.5183 0.7734 4.5764 13.6432 6.2274 6.5187 12.3965 11.0151 2.3708 6.0312 6.5825 16.9621 12.0323 0.7168 1.3112 4.6244 8.0552 49.2916 26.3426 169.6547 40.7984 41.4383 34.7719 22.7863 77.0555 36.5941 52.6677 40.6937 43.1914 23.9079 10.7093 4.6942 1.5531 0.7580 15.7715 15.7018 40.1688 37.6962 26.5597 25.1549
temp: 298.150 k
press: 1.00000 atm
elementType: 7 6 6 6 6 6 6 6 6 6 6 6 6 6 6 6 6 6 6 6 1 1 1 1 1 1 1 1 1 1 1 1 1 1 1 1 1 1 1 1 1 1 1
symmnumber: 1
zpe: 971293.2 jmol-1
zpe.correction: 0.369946 hartree
zpe.thermalcorrener: 0.387698 hartree
zpe.thermalcorrenthalpy: 0.388642 hartree
zpe.thermalcorrgfe: 0.321938 hartree
zpe.sumelectzpe: -791.094436 hartree
zpe.sumelectthermal: -791.076684 hartree
zpe.sumelectthermalent: -791.075740 hartree
zpe.sumelectthermalfe: -791.142444 hartree
dipole: -0.5384 -0.3780 0.5586
dipole: 0.8631
quadrupole: -114.9962 -115.9372 -116.9473
quadrupole: 4.6674 2.4827 -4.6970
quadrupole: 0.9640 0.0230 -0.9871 4.6674 2.4827 -4.6970
hfenergy: -791.4643824 hartree
pointgroup: C01 [X(C19H23N1)]
dipole: -0.1979862 -0.1640264 0.2218058 debye
polarizability: 233.3366257|18.2555927|203.8580956|17.516027|-18.5760937|161.9664494 unknown
InChI: InChI=1S/C19H23N/c1-4-10-17(11-5-1)16-19(18-12-6-2-7-13-18)20-14-8-3-9-15-20/h1-2,4-7,10-13,19H,3,8-9,14-16H2
charge 0 multiplicity 1
43 atoms
N  -2.021087 -0.583518 -0.117491
C  -0.562351 -0.460403 0.210033
C  -2.842715 0.153426 0.88818
C  -2.506758 -1.984638 -0.250463
C  -4.334984 0.176055 0.505806
C  -3.995451 -2.030953 -0.656942
C  -4.879338 -1.259296 0.345573
C  0.329247 -1.29866 -0.769828
C  -0.136407 1.010944 0.159363
C  1.812562 -1.224249 -0.437606
C  0.67409 1.570631 1.174929
C  -0.507516 1.821119 -0.944383
C  2.680108 -0.333761 -1.119233
C  2.357269 -2.050956 0.579789
C  1.110041 2.913559 1.093562
C  -0.076122 3.162611 -1.028805
C  0.737056 3.714698 -0.009565
C  4.054224 -0.27014 -0.795489
C  3.729586 -1.988875 0.910666
C  4.584454 -1.096745 0.222119
H  -0.362111 -0.847258 1.244619
H  -2.458538 1.184644 0.963066
H  -2.731266 -0.315558 1.902592
H  -2.369645 -2.549193 0.711517
H  -1.919365 -2.503389 -1.025795
H  -4.451464 0.726938 -0.44776
H  -4.899716 0.727946 1.281809
H  -4.314297 -3.088749 -0.731756
H  -4.100011 -1.578584 -1.662588
H  -4.85861 -1.772698 1.329354
H  -5.932933 -1.246819 0.007906
H  0.01826 -2.357493 -0.721873
H  0.135351 -0.939054 -1.79756
H  0.972198 0.950907 2.029639
H  -1.158824 1.39173 -1.714473
H  2.271874 0.318935 -1.899892
H  1.702386 -2.75602 1.108319
H  1.738811 3.331671 1.887988
H  -0.375141 3.779888 -1.884218
H  1.071802 4.756462 -0.073394
H  4.709014 0.424423 -1.334096
H  4.133228 -2.637867 1.696561
H  5.65029 -1.04931 0.473018
