program: Gaussian 09
title: 000016574
version: EM64L-G09RevD.01
frameworkgroup: C1[X(C14H17N3O9)]
method: RPBEPBE
basis: SDD
operation: Freq
keyword: #p
keyword: freq=noraman
keyword: PBEPBE/SDD
title: #p freq=noraman PBEPBE/SDD
converged: YES YES NO NO
title: Mulliken charges:
elementType: O O O O O O O O O N N N C C C C C C C C C C C C C C H H H H H H H H H H H H H H H H H
charge: -0.221280 -0.262714 -0.257251 -0.245822 -0.240460 -0.243893 -0.237315 -0.266742 -0.209869 -0.193575 0.065382 -0.391601 -0.042165 -0.142366 -0.071321 -0.111338 -0.364107 0.316404 0.301051 0.319422 -0.328231 0.333557 -0.757737 0.176230 -0.763502 -0.754480 0.291516 0.296940 0.259914 0.310410 0.249356 0.278619 0.366074 0.271103 0.260825 0.249266 0.251520 0.246699 0.253693 0.253378 0.249246 0.260625 0.244540
chargesum: 0.00000
title: Mulliken charges with hydrogens summed into heavy atoms:
elementType: O O O O O O O O O N N N C C C C C C C C C C C C C C
charge: -0.221280 -0.262714 -0.257251 -0.245822 -0.240460 -0.243893 -0.237315 -0.266742 -0.209869 -0.193575 0.065382 -0.025527 0.249351 0.154574 0.188592 0.199071 0.163868 0.316404 0.301051 0.319422 -0.057128 0.333557 0.003875 0.176230 -0.009733 -0.000069
polarizability: 2.47064089e+02 -7.17398167e+00 1.66147713e+02 1.33146754e+01 6.12947891e+00 1.85183253e+02
1716.lowfreq: -8.3986 -0.0008 -0.0007 0.0001 2.9021 6.8872 20.8182 29.1359 37.9588
frequency: 20.6957 29.1069 37.9268 42.1800 43.3154 52.8968 54.8805 57.7155 60.8747 67.0889 80.7311 82.9009 91.6020 100.3439 115.6214 146.7569 174.2813 180.2078 191.8560 200.1001 217.7456 234.8918 259.9255 275.2746 284.1351 344.9649 362.6066 383.9192 400.1950 406.3236 433.6878 467.7014 502.5461 515.3784 530.6896 547.7072 557.9829 564.0702 573.1889 587.4858 600.9965 616.1956 635.3461 691.2217 698.6125 707.8822 727.8641 767.1975 776.5667 782.0326 785.0662 813.2657 851.6021 865.6988 881.9472 895.4440 923.2706 945.8430 953.5144 975.0976 992.9222 1001.1068 1006.1457 1017.1523 1028.1736 1040.7197 1043.8824 1045.0405 1050.3193 1055.0271 1093.4952 1115.1827 1158.2692 1185.8263 1197.7232 1207.0015 1228.2293 1229.9337 1246.1784 1257.0393 1269.1693 1286.3205 1310.0639 1321.1859 1325.1133 1330.2893 1354.6641 1359.6976 1365.0093 1379.3000 1384.2656 1385.0633 1385.7837 1451.4044 1452.6890 1452.9391 1453.5339 1454.1828 1454.5837 1457.2274 1541.1675 1645.3667 1649.9005 1653.2494 1666.3749 1667.9390 3007.5642 3008.3616 3009.1118 3044.1926 3054.0579 3065.4542 3088.7230 3096.0058 3098.5662 3101.8703 3119.1131 3124.8119 3142.7107 3144.9330 3146.0633 3192.0643 3517.8181
redmass: 5.6812 1.1687 6.5151 6.3519 6.9523 2.4753 2.1860 2.3155 1.7634 2.4107 3.8086 2.3126 5.6353 6.1426 7.6557 5.3566 7.1861 7.7165 6.7514 7.3714 5.7333 6.4053 9.5244 5.3405 4.2643 3.9431 7.7331 5.1921 3.7699 4.5847 4.8522 4.7716 7.2153 3.1150 4.3606 6.8007 3.4253 3.2332 3.6595 6.5186 5.1606 4.5742 6.2009 5.5170 2.3400 8.1099 5.7469 4.8526 2.2031 4.9026 4.9165 4.0499 6.1874 1.4411 3.7171 5.0426 4.5131 3.6456 4.6681 2.8693 1.9364 2.4983 2.6749 3.3314 2.8075 1.6637 1.6644 1.6854 3.0881 3.6657 3.1515 3.4723 4.8364 3.3106 3.1703 3.6489 1.3793 3.5285 1.2020 1.5803 1.4089 1.5048 1.3579 1.7759 2.4118 1.3355 1.2409 1.4502 1.3706 1.5633 1.2663 1.2492 1.2513 1.0601 1.0600 1.0489 1.0505 1.0579 1.0561 1.0853 10.3348 7.8313 9.0919 9.2201 7.9328 9.2465 1.0382 1.0370 1.0373 1.0616 1.0833 1.0846 1.0865 1.0974 1.0963 1.0942 1.0874 1.1071 1.1025 1.1015 1.1009 1.0935 1.0772
irintensity: 0.0769 2.0673 0.7577 0.4512 0.9386 0.4333 0.1275 2.0236 0.7978 0.8432 1.0112 2.2191 4.5561 3.2833 0.7821 6.7679 6.8880 4.0694 1.3133 6.2061 7.2254 2.7144 0.4184 7.5608 4.4219 6.9828 17.0408 4.9425 7.9493 19.1818 5.4676 6.1690 17.2668 9.5555 23.8709 32.7721 11.3126 6.2063 10.3725 5.2514 21.9879 5.2988 2.8076 2.6830 30.4485 2.6125 17.8592 0.5282 133.4647 23.8468 10.0501 14.2461 33.6499 38.3608 9.4664 85.1470 97.9015 17.4590 30.0565 14.7594 42.2327 77.2812 115.5169 121.2708 19.1342 13.3333 10.2588 8.6018 15.5676 40.0969 1.4759 40.5089 33.5732 253.8851 521.7330 116.6778 37.9311 79.6652 21.5862 76.6661 34.2369 20.0853 39.9320 36.1997 90.2939 10.5718 1.5243 7.8838 1.7299 32.1024 23.8970 60.3086 90.5821 32.9314 21.1479 21.9557 36.5452 25.9088 5.9218 11.5280 7.9152 385.6668 83.0501 216.4413 564.6352 75.2225 1.1292 0.8754 1.5054 15.5860 10.7810 5.7013 12.5939 4.4877 6.3744 8.3807 7.3770 3.0921 7.2466 8.8757 8.2851 0.1049 64.6931
temp: 298.150 k
press: 1.00000 atm
elementType: 8 8 8 8 8 8 8 8 8 7 7 7 6 6 6 6 6 6 6 6 6 6 6 6 6 6 1 1 1 1 1 1 1 1 1 1 1 1 1 1 1 1 1
symmnumber: 1
zpe: 830169.1 jmol-1
zpe.correction: 0.316195 hartree
zpe.thermalcorrener: 0.342697 hartree
zpe.thermalcorrenthalpy: 0.343641 hartree
zpe.thermalcorrgfe: 0.255503 hartree
zpe.sumelectzpe: -1383.011995 hartree
zpe.sumelectthermal: -1382.985493 hartree
zpe.sumelectthermalent: -1382.984549 hartree
zpe.sumelectthermalfe: -1383.072687 hartree
dipole: -4.4293 1.1449 -1.8582
dipole: 4.9379
quadrupole: -142.4902 -148.6305 -158.5907
quadrupole: 3.0568 -0.8933 -1.0285
quadrupole: 7.4136 1.2733 -8.6869 3.0568 -0.8933 -1.0285
hfenergy: -1383.3281895 hartree
pointgroup: C01 [X(C14H17N3O9)]
dipole: -1.6565158 -0.6040708 -0.8155801 debye
polarizability: 232.1219516|30.7606522|184.5367419|8.1634433|15.5396971|181.7363615 unknown
InChI: InChI=1S/C14H17N3O9/c1-6(18)23-5-9-11(24-7(2)19)12(25-8(3)20)13(26-9)17-14(22)16-10(21)4-15-17/h4,9,11-13,16H,5H2,1-3H3
charge 0 multiplicity 1
43 atoms
O  0.063998 0.246355 -1.338524
O  -2.915192 -0.696679 0.292732
O  -1.122098 -2.450606 -0.580493
O  -0.259747 3.069871 -1.154663
O  3.358152 -0.736727 -1.268254
O  -3.679957 1.270372 1.283252
O  -1.944434 -3.542999 1.31601
O  1.90576 2.665227 -0.367377
O  4.522065 1.526154 2.67011
N  1.712758 -0.325913 0.371768
N  1.317698 0.202942 1.58733
N  3.947583 0.355881 0.720381
C  -1.531774 -0.202921 0.447083
C  -0.551421 -1.401142 0.28748
C  -1.129559 0.817136 -0.65886
C  0.632319 -0.819797 -0.510504
C  -0.819544 2.210915 -0.084036
C  3.038535 -0.259381 -0.153957
C  -3.923915 0.141957 0.802069
C  -1.845225 -3.471071 0.074554
C  2.225391 0.791849 2.342826
C  1.13844 3.165765 -1.22049
C  -5.273466 -0.520328 0.668042
C  3.647447 0.950864 1.970769
C  -2.438429 -4.40965 -0.947698
C  1.553699 3.937362 -2.449904
H  -1.420212 0.239199 1.45133
H  -0.277735 -1.835753 1.261362
H  -1.908067 0.886663 -1.437905
H  1.083361 -1.544426 -1.202691
H  -0.100769 2.15224 0.749954
H  -1.751675 2.697011 0.242216
H  4.910888 0.438768 0.377656
H  1.892427 1.197315 3.300665
H  -5.278268 -1.478616 1.215658
H  -5.483985 -0.74566 -0.391904
H  -6.053161 0.142658 1.068544
H  -2.843163 -5.300296 -0.446293
H  -3.24989 -3.89376 -1.491441
H  -1.679601 -4.701874 -1.692204
H  0.827891 4.732288 -2.681202
H  1.584431 3.24463 -3.310867
H  2.559144 4.359277 -2.304323
