program: Gaussian 09
title: 000206664
version: EM64L-G09RevD.01
frameworkgroup: C1[X(C8H9NO2)]
method: RPBEPBE
basis: SDD
operation: Freq
keyword: #pfreq=noraman
keyword: PBEPBE/SDD
title: #p freq=noraman PBEPBE/SDD
converged: NO YES NO NO
title: Mulliken charges:
elementType: O O N C C C C C C C C H H H H H H H H H
charge: -0.429097 -0.221819 -0.197186 -0.211873 -0.484261 0.256576 -0.387780 0.167221 -0.224702 -0.354841 -0.219910 0.262930 0.260294 0.244284 0.245931 0.245189 0.257092 0.277689 0.340608 0.173654
chargesum: 0.00000
title: Mulliken charges with hydrogens summed into heavy atoms:
elementType: O O N C C C C C C C C
charge: -0.088488 -0.221819 -0.197186 0.051057 0.020317 0.256576 0.103340 0.167221 0.032390 -0.077151 -0.046255
polarizability: 1.30393744e+02 -4.75977823e+00 1.02949017e+02 1.11846773e+00 5.28935226e+00 5.80098458e+01
1716.lowfreq: -11.5280 0.0003 0.0005 0.0008 1.8075 11.6747 60.5503 106.3530 124.1617
frequency: 60.5076 106.3514 124.1578 142.9485 201.9884 270.9476 273.4322 310.8422 400.0978 419.8209 494.0459 612.7721 619.0023 671.8639 728.8640 746.8355 758.0073 767.9829 812.1012 881.2388 910.2815 940.1223 976.0371 1000.9629 1021.2965 1044.8054 1057.1941 1144.6642 1172.3044 1186.8189 1220.0355 1229.9408 1244.7861 1287.3075 1308.2450 1344.9860 1365.7093 1378.5813 1399.1693 1434.2955 1461.0414 1470.4719 1503.2650 1541.2638 1613.6761 2878.3761 3005.0778 3032.1146 3065.6421 3077.7199 3107.5303 3219.7312 3244.2811 3544.6735
redmass: 3.5142 3.3954 4.5353 4.0002 3.3667 1.1268 2.9264 4.5737 6.0799 2.9669 4.4143 5.0305 3.6049 4.7578 3.3656 1.4806 2.6315 4.0390 2.3887 1.3267 2.1351 4.0371 1.7719 4.1439 2.1641 1.7835 1.5526 2.4961 1.2272 1.2175 1.6031 1.3378 1.3674 1.6905 1.3986 4.9868 1.4159 1.3578 2.9752 4.8381 1.1533 2.1254 1.3312 8.7678 6.4022 1.0846 1.0603 1.0648 1.1027 1.0872 1.1033 1.0909 1.1067 1.0664
irintensity: 1.0879 1.6088 1.7566 4.3383 10.5990 128.9584 2.4693 5.9851 19.1207 5.9837 4.3092 20.9315 0.5609 12.5399 12.0234 44.0646 30.9265 7.6466 28.5635 4.1450 14.0861 59.6304 4.6050 5.8302 6.2933 22.1714 30.2090 13.3806 26.9636 18.3833 26.3234 11.8563 7.2592 54.3860 9.3534 4.0805 37.0156 23.1709 2.2310 58.4563 8.9911 8.5727 17.0242 16.0789 322.1312 91.8841 48.5436 18.2167 15.8877 18.9006 19.5468 0.3953 1.8634 6.7051
temp: 298.150 k
press: 1.00000 atm
elementType: 8 8 7 6 6 6 6 6 6 6 6 1 1 1 1 1 1 1 1 1
symmnumber: 1
zpe: 411732.0 jmol-1
zpe.correction: 0.156820 hartree
zpe.thermalcorrener: 0.166633 hartree
zpe.thermalcorrenthalpy: 0.167577 hartree
zpe.thermalcorrgfe: 0.121258 hartree
zpe.sumelectzpe: -514.614979 hartree
zpe.sumelectthermal: -514.605167 hartree
zpe.sumelectthermalent: -514.604223 hartree
zpe.sumelectthermalfe: -514.650542 hartree
dipole: -6.4656 2.9152 0.0637
dipole: 7.0927
quadrupole: -75.8180 -64.6344 -61.4629
quadrupole: -1.4666 1.1486 2.4791
quadrupole: -8.5129 2.6707 5.8422 -1.4666 1.1486 2.4791
hfenergy: -514.7717997 hartree
pointgroup: C01 [X(C8H9N1O2)]
dipole: -2.5766948 -1.0703618 -0.0419592 debye
dipolederiv: -0.6369446 0.0838038 0.0177642 0.0985785 -0.6112304 0.2702842 -0.034034 0.4011739 -0.4553275 -1.2980488 -0.247855 -0.0380553 0.0299193 -0.4208192 -0.0187408 0.0451816 -0.0070164 -0.3501936 -0.7123039 -0.1051426 -0.0148333 -0.4043524 -0.1625774 -0.0248384 -0.030404 -0.0022294 -0.1203459 0.5147001 -0.1065011 -0.0576328 -0.1104642 0.6075647 -0.172635 -0.058654 -0.247849 0.5715236 -0.1277569 -0.1355099 0.041615 -0.0509981 -0.0445352 0.0277553 -0.0293497 0.0223705 0.0707889 0.4499695 0.3988335 0.0525626 0.3837634 -0.1622587 0.0506179 0.096811 -0.0187733 -0.1623495 0.5919347 0.0753419 0.0401485 -0.0324364 0.1078256 -0.0659718 -0.0173155 -0.0448798 0.2736533 -0.7257997 -0.3490005 -0.0598637 -0.5306174 -0.282818 -0.0563381 -0.0912419 -0.0353873 -0.0364646 -0.0875046 -0.053621 -0.0458262 -0.0782435 0.0007571 0.0629584 -0.024239 0.0274119 -0.1680184 -0.0410204 -0.0031326 0.0022001 0.2037698 0.0008498 0.0615787 0.0385138 0.0400681 -0.1855193 1.6157773 0.3402914 0.0451616 0.4730157 0.8366548 0.1584017 0.0484021 0.14537 0.1417698 0.0373424 -0.024764 -0.0274328 0.0229867 -0.0495751 -0.0681807 -0.0147534 -0.0346748 -0.0529652 -0.0262524 0.0730651 -0.0473447 0.0771492 0.039029 0.0251479 -0.0818796 0.0427418 0.0567861 0.0735173 -0.0097182 0.0489971 -0.0193136 0.0524483 0.0168254 0.0987988 -0.013367 -0.1192007 -0.0303386 -0.0378907 0.0282413 -0.0835179 -0.0348726 0.0773835 0.0808405 0.0935545 0.0230606 -0.0666636 -0.0152117 -0.0457216 0.0163648 0.0598632 -0.0263993 -0.1204672 -0.060645 -0.0963276 0.0689982 -0.0682477 -0.0092942 -0.0341458 0.0015244 -0.0439904 0.0031599 -0.0419156 0.2050703 0.0423264 0.0732048 0.021761 0.0377169 0.0779335 -0.0247868 0.0127105 -0.0253764 0.1832266 0.3524428 -0.0260309 0.0105084 -0.0279257 0.190031 -0.1757645 0.0641454 -0.1617881 0.1364869 0.0056249 0.1380854 0.037045 0.0287508 -0.2057946 -0.0733071 0.0137748 -0.0787885 0.084346 unknown
polarizability: 130.6232004|4.0622817|102.1858503|-1.5547005|7.0846049|58.5435557 unknown
InChI: InChI=1S/C8H9NO2/c10-5-6-1-3-9-4-2-7(11)8(6)9/h1,3,5,7,11H,2,4H2
charge 0 multiplicity 1
20 atoms
O  -1.111567 2.31543 -0.652373
O  3.550327 0.642031 0.14922
N  -0.818889 -1.005368 -0.03723
C  -1.116099 1.307061 0.434605
C  -2.491532 0.558393 0.574965
C  -0.144055 0.181896 0.201945
C  -2.291594 -0.890149 0.023184
C  1.243401 -0.077445 0.081125
C  0.087028 -2.034969 -0.30745
C  1.372076 -1.485095 -0.240132
C  2.315911 0.900922 0.25591
H  -0.894524 1.912313 1.326895
H  -3.27166 1.114458 0.031124
H  -2.781411 0.515249 1.638746
H  -2.714696 -1.657323 0.694213
H  -2.72783 -1.02988 -0.98315
H  -0.240161 -3.051354 -0.515339
H  2.314803 -2.007391 -0.392025
H  -0.989227 1.851364 -1.520725
H  1.9704 1.937556 0.497792
