program: Gaussian 09
title: 000206634
version: EM64L-G09RevD.01
frameworkgroup: C1[X(C16H24N2O2)]
method: RPBEPBE
basis: SDD
operation: Freq
keyword: #p
keyword: freq=noraman
keyword: PBEPBE/SDD
title: #p freq=noraman PBEPBE/SDD
converged: YES YES NO NO
title: Mulliken charges:
elementType: O O N N C C C C C C C C C C C C C C C C H H H H H H H H H H H H H H H H H H H H H H H H
charge: -0.346135 -0.290736 -0.067675 -0.146549 -0.358915 -0.362392 -0.374139 -0.372799 0.135465 0.527313 -0.613456 0.270637 -0.748158 -0.701239 -0.699514 -0.497363 0.348433 -0.444546 -0.426441 -0.215139 0.191325 0.216809 0.217556 0.195457 0.220633 0.252187 0.253137 0.225320 0.191246 0.225317 0.224477 0.215745 0.215457 0.214843 0.219432 0.205636 0.224876 0.203956 0.218776 0.234217 0.295221 0.249326 0.249291 0.223106
chargesum: 0.00000
title: Mulliken charges with hydrogens summed into heavy atoms:
elementType: O O N N C C C C C C C C C C C C C C C C
charge: -0.346135 -0.290736 -0.067675 -0.146549 0.049219 0.050621 0.098682 0.105658 0.135465 0.527313 0.027585 0.270637 -0.102112 -0.051294 -0.042565 -0.202142 0.348433 -0.195220 -0.177150 0.007966
polarizability: 2.70152792e+02 1.28805591e+00 1.94227292e+02 5.39974382e+00 -1.41352119e+00 1.28858830e+02
1716.lowfreq: -7.5615 -0.0010 -0.0009 -0.0007 2.6498 6.0075 16.9736 24.6856 39.6754
frequency: 14.9833 21.2313 39.6654 58.0005 60.8182 98.8089 118.2863 135.5371 164.2043 211.8999 215.6257 223.1197 234.0707 242.8002 265.7374 301.5347 309.4651 312.1552 317.0046 321.1727 330.3046 347.5885 364.1844 380.7042 405.8324 422.9797 459.8015 471.9928 474.9992 521.7150 563.6277 593.0707 611.9533 643.4285 676.3313 683.9267 704.0883 744.5542 768.5954 795.2291 807.0617 841.0013 880.1482 896.7204 909.5252 922.2560 932.1187 934.7581 945.8819 972.6736 975.8866 988.6747 1003.8378 1020.3686 1025.4734 1046.5742 1053.8377 1066.4736 1081.6494 1084.2591 1115.8313 1126.4513 1148.9719 1163.0663 1170.1765 1186.9040 1198.9406 1205.2987 1212.2788 1218.1880 1245.7303 1274.8144 1287.3557 1290.0667 1301.0634 1334.9945 1352.1941 1360.6683 1369.6185 1373.9295 1375.7523 1380.6069 1402.2576 1403.6122 1423.3699 1431.9718 1455.9350 1458.4053 1460.6129 1461.2157 1464.7101 1465.9573 1468.0142 1474.8198 1475.9007 1482.2422 1483.6114 1487.3487 1499.1091 1595.4147 1603.4239 1651.1294 2846.7068 2852.9550 2870.2156 2971.5548 2972.6239 2977.4749 2986.4239 2989.6123 3020.9822 3032.2203 3037.7959 3065.5912 3067.2118 3070.2552 3075.1591 3078.6359 3080.7479 3084.2858 3099.8855 3128.7509 3132.3675 3161.1458 3171.3279 3193.4132
redmass: 3.6294 4.7259 3.1353 4.6328 4.7815 5.0467 3.4498 3.6123 3.0942 1.5605 1.0527 3.0459 1.7929 3.3135 1.1297 2.6570 1.8013 2.0817 1.6541 2.2952 2.6355 3.9510 3.4892 2.4474 2.0563 3.7338 3.0440 3.2875 2.7949 2.8394 3.4558 5.0567 4.2866 3.1962 10.3171 6.1483 1.9976 3.5676 5.6939 1.5528 3.5321 1.5794 3.1763 1.4581 1.4958 1.6536 1.9446 1.7373 1.2014 1.3348 3.4930 5.4801 2.4793 1.4266 1.3937 2.1436 1.9571 1.7106 1.7687 1.6488 1.5991 1.6498 2.5573 2.6647 1.8404 1.5588 1.0933 2.9790 1.7678 2.8652 4.1552 3.1154 1.5780 1.4713 1.3246 1.2512 1.3471 1.3337 1.4864 1.1844 1.3689 4.4939 2.3402 1.2319 2.9089 1.1706 1.0793 1.0815 1.0502 1.0700 1.0925 1.0622 1.2448 1.1053 1.4127 1.0529 1.1840 1.0833 1.0847 6.3218 6.6762 9.9455 1.0706 1.0657 1.0602 1.0349 1.0348 1.0358 1.0689 1.0672 1.0735 1.0885 1.0901 1.1002 1.0998 1.1001 1.0986 1.1009 1.0996 1.0990 1.0963 1.0933 1.0870 1.0916 1.0978 1.0916
irintensity: 0.2662 1.1074 0.0707 0.7930 1.7238 1.2099 0.3521 1.1061 1.8520 1.5931 0.0180 0.1795 2.6401 0.9636 0.0603 1.2355 1.5261 11.9354 0.3269 1.8417 1.9289 10.1162 0.9807 0.2155 1.6500 3.4483 4.7499 1.0096 0.3117 0.8535 10.2812 1.6678 0.5800 0.1994 12.2973 4.0371 33.9597 4.8946 17.7843 41.1083 5.9532 1.9751 25.6995 1.1512 11.9026 6.3837 2.6399 10.9225 0.6323 0.6670 94.1765 1.0363 108.3256 0.1545 0.1486 87.9983 29.0523 11.5338 24.7316 21.7393 52.6813 70.4433 50.8116 128.0332 118.7064 207.4233 4.1880 6.0711 360.4304 7.3311 30.0051 66.5033 37.2029 23.8019 10.4878 2.3569 2.6172 12.4288 1.7104 18.2087 8.7036 5.4410 244.2587 13.3955 22.1345 3.4671 1.5513 20.3985 0.1912 26.2704 23.9926 2.9500 27.7484 9.1584 24.0584 8.7292 37.0181 16.7599 31.2838 70.4392 34.5890 415.6746 50.5745 49.3333 200.5764 29.1790 33.4984 35.1012 20.0495 65.6030 49.7438 50.3591 54.0568 5.4538 3.0186 32.4148 111.0188 32.2622 21.3582 54.6334 5.5566 4.9283 11.4125 14.9562 14.4702 3.1313
temp: 298.150 k
press: 1.00000 atm
elementType: 8 8 7 7 6 6 6 6 6 6 6 6 6 6 6 6 6 6 6 6 1 1 1 1 1 1 1 1 1 1 1 1 1 1 1 1 1 1 1 1 1 1 1 1
symmnumber: 1
zpe: 982908.8 jmol-1
zpe.correction: 0.374370 hartree
zpe.thermalcorrener: 0.394824 hartree
zpe.thermalcorrenthalpy: 0.395768 hartree
zpe.thermalcorrgfe: 0.324036 hartree
zpe.sumelectzpe: -882.513375 hartree
zpe.sumelectthermal: -882.492921 hartree
zpe.sumelectthermalent: -882.491977 hartree
zpe.sumelectthermalfe: -882.563709 hartree
dipole: 2.2223 1.2797 -0.0991
dipole: 2.5663
quadrupole: -99.4431 -116.4020 -124.1998
quadrupole: 0.7067 -2.7330 -1.0953
quadrupole: 13.9053 -3.0537 -10.8515 0.7067 -2.7330 -1.0953
hfenergy: -882.8877451 hartree
pointgroup: C01 [X(C16H24N2O2)]
dipole: 0.8503553 0.3239715 -0.4374813 debye
polarizability: 268.9979563|12.81055|151.5329748|3.2867817|-30.6348019|172.7079824 unknown
InChI: InChI=1S/C16H24N2O2/c1-16(2,3)13-6-5-7-14(12-13)20-15(19)18-10-8-17(4)9-11-18/h5-7,12H,8-11H2,1-4H3
charge 0 multiplicity 1
44 atoms
O  0.437161 0.450498 -0.51984
O  0.624302 -1.305145 1.075009
N  5.252626 0.019967 -0.038552
N  2.441907 0.062446 0.516252
C  4.310921 0.658604 -0.988777
C  4.608751 -1.118591 0.66056
C  3.058111 1.167574 -0.2467
C  3.365209 -0.638252 1.432909
C  -4.263653 -1.095551 0.597482
C  -3.266314 -0.361199 -0.33199
C  6.530023 -0.355669 -0.674247
C  1.131999 -0.353397 0.424867
C  -5.724301 -1.001901 0.086901
C  -4.205622 -0.469061 2.023347
C  -3.868743 -2.601583 0.681245
C  -1.890638 -0.335364 0.029794
C  -0.955917 0.311552 -0.802922
C  -3.664181 0.278665 -1.531976
C  -1.351573 0.94928 -2.000469
C  -2.713404 0.927413 -2.355562
H  3.993041 -0.050132 -1.797132
H  4.8182 1.515974 -1.469198
H  5.332752 -1.552722 1.374779
H  4.3044 -1.925602 -0.054694
H  3.361863 1.963846 0.461838
H  2.322687 1.57677 -0.952476
H  2.827049 -1.484771 1.887486
H  3.681107 0.062674 2.230622
H  6.417236 -1.12226 -1.482085
H  7.218285 -0.762007 0.088386
H  7.002199 0.539739 -1.116788
H  -6.393406 -1.539057 0.783903
H  -6.0718 0.046483 0.029443
H  -5.841356 -1.464244 -0.91065
H  -4.482537 0.600905 1.994691
H  -4.909894 -0.992449 2.697352
H  -3.195622 -0.546489 2.46321
H  -4.55547 -3.138118 1.363176
H  -3.925991 -3.078515 -0.314652
H  -2.839373 -2.73268 1.058786
H  -1.541076 -0.831047 0.936158
H  -4.714557 0.277385 -1.83567
H  -0.599237 1.444695 -2.621259
H  -3.037467 1.41794 -3.280255
