program: Gaussian 09
title: 000206632
version: EM64L-G09RevD.01
frameworkgroup: C1[X(C14H18N6)]
method: RPBEPBE
basis: SDD
operation: Freq
keyword: #pfreq=noraman
keyword: PBEPBE/SDD
title: #p freq=noraman PBEPBE/SDD
converged: YES YES NO NO
title: Mulliken charges:
elementType: N N N N N N C C C C C C C C C C C C C C H H H H H H H H H H H H H H H H H H
charge: -0.361957 -0.125667 -0.121329 -0.124149 -0.581590 -0.004409 -0.039949 -0.424768 -0.452079 -0.400820 -0.413201 -0.376898 0.039125 0.038743 -0.009779 0.288734 -0.277214 -0.438702 -0.194159 -0.336195 0.246926 0.193068 0.234966 0.218559 0.201646 0.203819 0.205029 0.185134 0.210044 0.193553 0.203527 0.320892 0.278306 0.282967 0.335746 0.331848 0.229487 0.240746
chargesum: 0.00000
title: Mulliken charges with hydrogens summed into heavy atoms:
elementType: N N N N N N C C C C C C C C C C C C C C
charge: -0.041066 -0.125667 -0.121329 -0.124149 0.086003 -0.004409 0.206977 0.003267 -0.031874 0.008028 -0.018023 0.020182 0.039125 0.038743 -0.009779 0.288734 0.001092 -0.155735 0.035328 -0.095449
polarizability: 2.65785110e+02 8.47317029e+00 2.26091634e+02 -8.38193463e+00 6.70271789e+00 1.10514718e+02
1716.lowfreq: -7.3847 -0.0002 0.0003 0.0006 3.8934 6.8843 31.9995 41.5937 50.8653
frequency: 31.8231 39.9663 50.7737 59.0392 86.2801 109.8579 146.4315 175.3415 185.2424 213.4384 222.1708 247.7647 287.6103 336.7152 352.3550 372.3999 386.7509 416.5990 449.1334 457.9762 480.6018 489.1036 511.5448 546.9923 569.6894 581.2102 611.9014 618.4865 661.4798 694.5224 713.7054 716.4923 722.0430 774.9064 797.9771 800.8586 830.9835 836.1085 862.4168 868.4643 887.5021 916.1010 927.8954 942.6700 960.5325 966.9125 995.2079 1004.5308 1006.2132 1009.9475 1025.2633 1045.8228 1051.6825 1070.3243 1088.3674 1102.7770 1111.3694 1148.5640 1165.9020 1172.4672 1192.6934 1237.3687 1243.9617 1258.2952 1270.3691 1291.5464 1309.9127 1312.9975 1317.9929 1328.3666 1335.9930 1341.2922 1349.1421 1354.2811 1369.3622 1390.4400 1405.8145 1426.3749 1456.5459 1459.9216 1466.3663 1468.0318 1471.9928 1479.5219 1492.3374 1516.7420 1550.9110 1559.1281 1587.3571 1617.9584 2954.8924 2967.6009 2973.6338 2975.4070 2983.6390 3027.4288 3030.4818 3035.3049 3039.4506 3044.8999 3052.4003 3129.1664 3152.8242 3164.0773 3173.8113 3554.9400 3557.5339 3715.1738
redmass: 4.5278 3.4829 4.3541 4.1841 5.5827 4.0261 5.4454 4.8453 5.9176 2.9867 3.6452 2.8517 3.4625 3.1334 2.9150 2.3810 2.9838 2.8924 4.3160 2.8753 2.4162 1.2440 3.0491 1.0438 6.9745 1.2020 7.9007 3.0546 5.1197 7.6163 6.0279 8.1808 1.8555 1.5062 3.6673 4.9453 1.7065 2.0468 2.2985 2.7372 4.8217 4.3862 1.6078 1.3493 3.2947 1.5292 2.6367 1.3927 2.6908 2.8038 3.2989 1.5349 1.6450 2.0863 1.6726 1.5414 1.0458 1.9836 2.2085 2.7663 1.3578 3.7482 1.4756 1.2944 1.3565 1.7555 4.8604 1.4547 1.6378 1.3314 1.4624 1.8208 1.4933 1.6654 1.5364 2.1212 2.6296 3.2690 1.0859 1.0983 2.4627 1.1539 1.0970 1.1990 2.7785 3.4085 3.3511 5.9785 5.1664 2.0738 1.0670 1.0622 1.0644 1.0622 1.0618 1.0928 1.0960 1.0896 1.0996 1.1012 1.1006 1.0882 1.0923 1.0922 1.0987 1.0462 1.0739 1.1058
irintensity: 1.2175 0.2259 1.0531 0.6273 3.4591 0.7273 2.7938 1.6046 1.6437 0.2349 2.4628 0.2654 0.0485 3.4254 2.7275 0.8797 0.4222 3.8296 10.6547 4.0493 1.1708 261.3422 3.7688 0.7041 8.6571 107.1035 1.1521 7.4182 13.9538 5.2136 0.4711 0.1770 34.8310 0.8209 3.9919 54.8524 6.6734 8.1020 14.8021 7.3375 2.1560 8.1573 17.5639 1.0931 4.6355 3.2970 3.5732 0.6778 13.7266 4.5140 0.7681 1.2789 0.3135 5.5731 1.0995 15.2640 1.4551 8.0926 6.3396 2.7758 24.5938 6.6945 5.9348 4.5287 31.5043 5.9154 10.3324 1.0207 8.0030 0.0173 0.1915 22.2062 2.5830 19.7108 28.4215 127.7980 199.8188 9.0114 11.5455 6.2253 19.9810 22.3570 14.2698 35.1214 480.2000 535.5329 565.3851 385.4412 58.0172 292.6401 29.5036 39.9571 24.3483 23.7222 26.0811 77.5270 78.8962 9.6434 27.0211 48.0467 78.7505 11.1657 23.9982 3.2535 14.4468 117.1300 64.2379 46.6687
temp: 298.150 k
press: 1.00000 atm
elementType: 7 7 7 7 7 7 6 6 6 6 6 6 6 6 6 6 6 6 6 6 1 1 1 1 1 1 1 1 1 1 1 1 1 1 1 1 1 1
symmnumber: 1
zpe: 821313.5 jmol-1
zpe.correction: 0.312822 hartree
zpe.thermalcorrener: 0.330080 hartree
zpe.thermalcorrenthalpy: 0.331024 hartree
zpe.thermalcorrgfe: 0.266665 hartree
zpe.sumelectzpe: -871.372134 hartree
zpe.sumelectthermal: -871.354875 hartree
zpe.sumelectthermalent: -871.353931 hartree
zpe.sumelectthermalfe: -871.418291 hartree
dipole: 4.8173 0.2027 -0.2960
dipole: 4.8307
quadrupole: -127.7130 -94.3423 -121.0614
quadrupole: -1.0593 -0.5135 2.5220
quadrupole: -13.3408 20.0299 -6.6892 -1.0593 -0.5135 2.5220
hfenergy: -871.6849555 hartree
pointgroup: C01 [X(C14H18N6)]
dipole: 1.8969887 -0.0425017 0.1078247 debye
polarizability: 266.1795288|-7.706723|225.62574|7.4954697|7.9886363|110.586193 unknown
InChI: InChI=1S/C14H18N6/c15-13-18-12(10-5-4-8-16-9-10)19-14(20-13)17-11-6-2-1-3-7-11/h4-5,8-9,11,17H,1-3,6-7,15H2
charge 0 multiplicity 1
38 atoms
N  2.098015 -0.584374 0.379294
N  -0.197944 -0.073566 0.182329
N  0.63594 -2.369553 0.034295
N  -1.75788 -1.906418 -0.152291
N  -0.92167 -4.087026 -0.305179
N  -5.008308 0.773421 -0.14472
C  2.497419 0.828845 0.557743
C  2.674474 1.552349 -0.807322
C  3.802641 0.897469 1.389302
C  3.8998 1.028086 -1.591635
C  5.037828 0.384553 0.606104
C  5.192951 1.124385 -0.745055
C  0.813341 -1.011688 0.190994
C  -1.458262 -0.583254 0.014151
C  -0.664812 -2.75149 -0.136067
C  -2.589202 0.382076 0.013298
C  -2.362143 1.773467 0.168985
C  -3.93017 -0.06322 -0.140151
C  -3.465458 2.650898 0.166189
C  -4.763824 2.110875 0.007922
H  1.674192 1.318389 1.108494
H  2.802249 2.63601 -0.605809
H  1.745751 1.438225 -1.39581
H  3.674532 0.336204 2.334806
H  3.971913 1.957596 1.662767
H  4.015672 1.598556 -2.532875
H  3.725788 -0.028205 -1.882426
H  4.952573 -0.707039 0.417297
H  5.947235 0.515075 1.22316
H  5.41879 2.192865 -0.54713
H  6.052986 0.713922 -1.308402
H  2.809067 -1.317644 0.369432
H  -1.334073 2.127822 0.287318
H  -4.131195 -1.13137 -0.261989
H  -1.88425 -4.389304 -0.430533
H  -0.150197 -4.748917 -0.298913
H  -3.330101 3.730758 0.283814
H  -5.647364 2.759919 0.001209
