program: Gaussian 09
title: 000206630
version: EM64L-G09RevD.01
frameworkgroup: C1[X(C20H27NO)]
method: RPBEPBE
basis: SDD
operation: Freq
keyword: #p
keyword: freq=noraman
keyword: PBEPBE/SDD
title: #p freq=noraman PBEPBE/SDD
converged: NO YES NO NO
title: Mulliken charges:
elementType: O N C C C C C C C C C C C C C C C C C C C C H H H H H H H H H H H H H H H H H H H H H H H H H H H
charge: -0.178918 -0.083291 0.144869 -0.026360 -0.439480 0.353593 -0.394819 -0.402203 -0.757156 -0.235827 0.156112 -0.392607 -0.720493 0.400357 -0.283641 -0.353978 -0.481471 -0.622353 -0.620097 -0.445120 -0.296449 -0.248186 0.186609 0.231007 0.198334 0.230968 0.208551 0.202216 0.249621 0.205375 0.217479 0.254037 0.190064 0.251145 0.223975 0.210622 0.213037 0.229440 0.219405 0.241430 0.233500 0.183883 0.217131 0.188609 0.221239 0.219771 0.239812 0.228833 0.231424
chargesum: 0.00000
title: Mulliken charges with hydrogens summed into heavy atoms:
elementType: O N C C C C C C C C C C C C C C C C C C C C
charge: -0.178918 -0.083291 0.144869 0.160249 -0.010138 0.353593 0.044700 0.049634 -0.080264 -0.045763 0.156112 -0.141462 -0.072859 0.400357 -0.054200 -0.134573 -0.240040 0.012160 0.009522 -0.205308 -0.067616 -0.016762
polarizability: 2.58844001e+02 -9.15799526e+00 1.83606661e+02 1.28546383e+01 1.07414629e+01 2.34085021e+02
1716.lowfreq: -7.6627 -0.0007 0.0006 0.0007 4.7324 12.6276 20.4802 31.5538 46.1723
frequency: 19.8766 31.4795 46.1089 56.4549 63.2041 70.9578 93.0757 107.5627 115.2540 135.0362 171.5455 179.4825 183.6381 194.5578 215.6983 217.9585 223.9007 238.7069 253.8335 268.9986 293.8374 307.9910 321.0338 351.0572 365.4449 387.9232 415.1993 427.7239 432.7456 441.1266 471.5612 490.4733 515.3233 523.4768 564.7445 593.1282 631.4840 658.3062 697.4964 741.5230 765.8313 779.3758 779.9434 786.2782 792.3996 809.3249 824.8812 843.4619 868.8013 881.4684 904.9195 911.3397 956.7383 968.2356 981.1968 983.6269 991.9947 996.1155 1011.0870 1018.4282 1032.1733 1034.9829 1039.1070 1051.6967 1072.8744 1086.0262 1094.9311 1098.7416 1125.4474 1139.3718 1144.9193 1154.7323 1161.4465 1175.5802 1183.7922 1190.5775 1232.5492 1240.3476 1255.7255 1261.7946 1266.2192 1276.7754 1284.8855 1313.2256 1316.4903 1323.1730 1348.8542 1367.7941 1375.6766 1385.2372 1390.5462 1399.3801 1401.4530 1405.6817 1418.7465 1439.8712 1441.4458 1450.4803 1456.6327 1461.1297 1464.9588 1467.3189 1472.3538 1474.9537 1477.8033 1482.4248 1485.6223 1486.4758 1488.4742 1518.0207 1582.9484 1600.5746 1629.0161 1631.5577 2840.9182 2851.3871 2869.0486 2874.6648 2975.4198 2975.6876 2986.2829 3001.4145 3014.8337 3015.6266 3022.9737 3036.7739 3050.6196 3071.2842 3071.4944 3075.0103 3077.6610 3080.1283 3081.8729 3094.6942 3120.8960 3122.1378 3130.3632 3134.3824 3156.1847 3158.4247 3195.5901
redmass: 3.0102 3.3503 3.8349 3.0908 3.1743 3.1127 3.2498 2.8182 2.6500 3.4677 3.4219 2.7076 1.4422 1.8623 1.2931 1.6124 1.5636 2.4864 2.0953 2.7905 2.6744 3.0953 3.2218 2.7760 2.7624 3.0127 2.3462 3.6756 3.2523 2.2866 3.2461 3.5829 5.6527 5.2117 3.3954 3.0163 4.0776 3.2798 2.9625 1.2958 1.5530 1.8037 2.8044 3.0019 1.8901 1.8079 3.3609 2.3213 1.8267 2.2933 2.8662 1.5099 1.3574 1.2799 1.3636 1.8598 1.3547 2.9506 2.1397 1.9940 1.6412 2.1778 2.3472 2.7494 2.1469 1.5003 2.0348 2.3253 1.8930 1.7369 1.9156 1.6667 1.8133 1.1631 1.5730 2.0884 2.0425 1.7005 1.6080 2.1388 1.3713 1.7155 1.3537 1.2177 1.4483 1.2193 1.4227 2.0658 1.3389 1.2364 1.2324 2.5132 1.2222 4.1855 1.1433 1.1895 2.1831 1.1569 2.0416 1.0568 1.0661 1.0520 1.0450 1.0515 1.0625 1.0692 1.0579 1.0471 1.0771 3.7574 6.8151 5.3860 7.2121 7.5845 1.0576 1.0594 1.0835 1.0687 1.0371 1.0628 1.0383 1.0797 1.0616 1.0711 1.0704 1.0977 1.0880 1.0989 1.0996 1.1011 1.0988 1.1000 1.1003 1.0981 1.0866 1.0858 1.0911 1.0904 1.0993 1.0983 1.0919
irintensity: 0.1906 0.2078 0.0972 0.5341 0.8002 0.3378 2.1639 2.3321 1.8859 0.3710 1.3768 1.7626 0.4756 0.5322 1.3106 0.3699 0.3330 0.1528 2.4022 2.4451 3.3077 0.7390 0.3882 9.5680 4.0357 1.8507 0.1186 6.6840 3.8206 0.9682 0.0756 12.4827 1.9349 7.4818 0.7804 5.6005 3.5506 0.7650 1.5082 5.4466 5.7444 21.4867 7.6487 27.3080 60.0964 38.7494 8.0632 2.4630 3.1607 4.1027 3.0651 1.6734 4.7306 3.8043 2.3643 6.3718 0.9362 21.0789 6.4655 9.2722 19.9653 14.4514 27.3181 20.2579 1.6240 4.2434 4.9473 2.6690 19.8696 13.1435 1.4644 2.0206 4.2166 2.3064 0.5687 7.1391 3.4507 1.9387 2.2737 9.9519 0.3139 3.7247 1.1218 13.3719 7.4263 1.8866 2.2735 3.3119 2.0163 14.3338 14.7461 5.0267 9.6770 5.4135 2.2539 1.8922 5.3106 3.2805 2.2915 13.4352 1.8347 6.7672 6.7372 31.4706 2.0734 11.7030 14.7680 9.3241 8.7468 10.0360 6.1768 3.9273 61.3219 76.7294 67.9231 129.1503 72.6493 131.0140 37.4918 9.6240 27.6635 22.8432 8.5922 43.9008 55.7785 7.8137 2.5429 37.9914 52.3151 10.0217 30.9010 52.2540 62.5468 28.7716 3.8165 1.2589 21.2778 17.1633 32.6583 29.9231 12.8555
temp: 298.150 k
press: 1.00000 atm
elementType: 8 7 6 6 6 6 6 6 6 6 6 6 6 6 6 6 6 6 6 6 6 6 1 1 1 1 1 1 1 1 1 1 1 1 1 1 1 1 1 1 1 1 1 1 1 1 1 1 1
symmnumber: 1
zpe: 1100703.0 jmol-1
zpe.correction: 0.419236 hartree
zpe.thermalcorrener: 0.442304 hartree
zpe.thermalcorrenthalpy: 0.443248 hartree
zpe.thermalcorrgfe: 0.366480 hartree
zpe.sumelectzpe: -906.608495 hartree
zpe.sumelectthermal: -906.585426 hartree
zpe.sumelectthermalent: -906.584482 hartree
zpe.sumelectthermalfe: -906.661250 hartree
dipole: -3.0020 -0.7610 -0.8784
dipole: 3.2191
quadrupole: -136.8958 -131.3081 -127.5488
quadrupole: -4.7420 -3.8858 1.8694
quadrupole: -4.9782 0.6094 4.3688 -4.7420 -3.8858 1.8694
hfenergy: -907.0277303 hartree
pointgroup: C01 [X(C20H27N1O1)]
dipole: 1.1371743 0.4480364 -0.3317489 debye
polarizability: 260.2072297|0.8330061|182.521485|-11.0606337|-12.3033089|233.8069686 unknown
InChI: InChI=1S/C20H27NO/c1-5-16(2)20(15-22,13-14-21(3)4)19-12-8-10-17-9-6-7-11-18(17)19/h6-12,15-16H,5,13-14H2,1-4H3
charge 0 multiplicity 1
49 atoms
O  -3.047477 -0.075491 1.810668
N  -1.619513 -3.217879 -0.805732
C  -1.126488 0.503633 0.336224
C  -1.433293 1.868835 -0.469449
C  -1.540302 -0.732298 -0.527988
C  0.345784 0.381451 0.819345
C  -2.96359 2.165804 -0.570891
C  -1.316137 -2.110074 0.136937
C  -0.671569 3.093438 0.091672
C  -2.047211 0.638051 1.563082
C  1.498439 0.439146 -0.068927
C  0.58376 0.132673 2.182827
C  -3.317274 3.103442 -1.746399
C  2.833682 0.284294 0.492198
C  1.892821 -0.02017 2.728503
C  1.414719 0.627524 -1.493059
C  3.005048 0.063683 1.897216
C  -2.006642 -4.462522 -0.1115
C  -0.538386 -3.457742 -1.782729
C  3.984263 0.344174 -0.363329
C  2.551467 0.67667 -2.302987
C  3.855513 0.538909 -1.737597
H  -1.089686 1.698144 -1.508034
H  -2.61393 -0.664499 -0.775989
H  -0.985047 -0.695725 -1.482249
H  -3.527554 1.222331 -0.692329
H  -3.320636 2.617995 0.37646
H  -0.27242 -2.186184 0.531293
H  -2.002253 -2.195901 0.997425
H  -0.942392 3.295126 1.144956
H  -0.921014 3.997794 -0.491927
H  0.42141 2.957847 0.044211
H  -1.802946 1.505444 2.22777
H  -0.260031 0.026123 2.87331
H  -4.407393 3.279678 -1.79198
H  -3.007892 2.65955 -2.711831
H  -2.825711 4.08895 -1.654998
H  2.009641 -0.207674 3.801214
H  0.43995 0.73344 -1.969708
H  4.019123 -0.048566 2.298419
H  -2.869524 -4.26696 0.549018
H  -1.185044 -4.902752 0.510787
H  -2.309642 -5.222477 -0.855111
H  0.412749 -3.809501 -1.30549
H  -0.310761 -2.534525 -2.343102
H  -0.860542 -4.222993 -2.51202
H  4.975963 0.228621 0.090552
H  2.441036 0.820777 -3.383519
H  4.740834 0.581688 -2.381014
