program: Gaussian 09
title: 000206628
version: EM64L-G09RevD.01
frameworkgroup: C1[X(C21H30N2O2)]
method: RPBEPBE
basis: SDD
operation: Freq
keyword: #p
keyword: freq=noraman
keyword: PBEPBE/SDD
title: #p freq=noraman PBEPBE/SDD
converged: YES YES NO NO
title: Mulliken charges:
elementType: O O N N C C C C C C C C C C C C C C C C C C C C C H H H H H H H H H H H H H H H H H H H H H H H H H H H H H H
charge: -0.199904 -0.208531 -0.163702 -0.105924 0.116499 -0.512275 -0.639376 0.290250 0.131841 -0.448824 -0.553948 0.276648 0.152158 -0.401701 -0.383574 -0.367735 -0.380527 -0.366570 -0.256421 -0.262146 -0.351907 -0.321934 -0.319059 -0.678486 -0.676015 0.217402 0.220744 0.270970 0.279427 0.206381 0.267806 0.220927 0.230120 0.241444 0.238985 0.239842 0.228773 0.202969 0.234434 0.213324 0.221766 0.228494 0.230312 0.176654 0.194158 0.176031 0.224425 0.181897 0.202252 0.203550 0.203306 0.233432 0.229327 0.207294 0.204717
chargesum: 0.00000
title: Mulliken charges with hydrogens summed into heavy atoms:
elementType: O O N N C C C C C C C C C C C C C C C C C C C C C
charge: -0.199904 -0.208531 -0.163702 -0.105924 0.116499 -0.074130 -0.088979 0.290250 0.131841 0.025364 -0.102901 0.276648 0.152158 0.078728 -0.143733 0.064008 -0.146093 0.068520 -0.027927 -0.031833 0.018906 0.078522 0.065090 -0.038198 -0.034678
polarizability: 2.51804746e+02 -7.14129035e+00 2.59659982e+02 -1.88809774e+01 6.56198859e+00 1.99410926e+02
1716.lowfreq: -12.0563 -4.9417 -0.0007 -0.0005 -0.0001 3.5882 9.7327 12.1087 28.5909
frequency: 9.1299 10.1918 28.5592 36.8834 54.8751 57.7383 66.1232 71.3517 79.1312 101.9983 107.9097 125.3473 154.4063 168.1309 195.4547 197.4216 207.1281 234.6429 248.1531 276.8296 284.7465 292.3160 303.8445 308.7385 313.0631 315.2766 364.5049 394.8522 407.7917 436.8694 442.0380 459.1486 471.6585 486.9274 507.1615 512.9869 567.7256 578.3129 584.1351 631.8883 649.8848 669.6185 696.5382 733.6819 737.1829 740.7788 756.1424 773.7226 795.3741 798.3826 800.3360 829.7032 857.8260 860.9579 873.1034 885.3387 902.4721 920.3018 940.8403 949.6980 961.1707 983.0165 988.1294 997.6792 1018.3061 1031.0454 1046.1429 1053.6383 1066.3502 1073.4007 1077.5495 1082.2328 1085.1629 1086.6145 1101.3686 1106.1648 1125.8431 1137.8768 1147.8512 1150.1642 1165.7387 1176.9283 1182.7580 1195.4420 1204.9946 1213.9034 1225.6819 1233.4138 1255.4299 1260.2819 1279.4992 1281.6102 1283.9296 1290.8786 1293.1541 1294.4837 1323.8566 1330.5121 1340.5896 1345.0820 1357.2258 1358.5903 1362.5960 1367.0919 1368.4834 1377.2176 1379.0471 1385.6010 1386.1628 1436.3813 1445.4484 1449.7201 1451.9746 1458.2255 1462.0573 1463.3164 1464.0828 1470.0737 1473.3784 1473.6641 1477.5119 1483.0657 1486.4965 1486.8807 1490.3633 1585.4786 1609.7657 1618.6912 1683.4544 2825.5862 2833.4490 2849.5375 2954.1640 2971.2417 2976.0695 2981.7611 2982.0732 2990.9312 3003.4440 3012.5422 3014.2820 3019.3028 3026.3164 3029.4307 3034.3578 3034.5963 3038.4340 3059.7544 3071.1844 3072.6320 3074.4561 3081.5568 3087.3600 3091.5365 3093.4447 3112.3117 3116.6847 3136.3558 3158.6024
redmass: 3.4959 3.8598 4.4607 4.7604 3.0213 5.0453 3.3046 3.2131 2.1034 1.9511 4.6384 2.3106 3.1695 2.5737 1.9319 2.3003 1.4464 2.9038 3.0933 2.2918 2.0131 3.4825 2.7725 2.8362 2.4381 2.7170 4.9448 3.3993 3.3122 2.9279 2.7381 3.1745 3.1730 3.0723 3.1113 3.9286 3.7614 3.1054 4.3876 4.6539 3.2245 4.2791 5.7333 1.5814 1.7284 2.8112 2.3924 1.8433 1.1475 1.5853 1.9347 1.9979 1.4847 1.5983 2.3901 1.5273 2.6735 1.9187 1.7890 1.8260 2.0111 2.3991 1.3298 2.2525 3.3830 3.1081 2.4331 2.6543 2.4160 1.8781 2.1281 2.5118 2.1041 2.7846 2.0639 1.9959 2.0696 1.9770 1.5754 1.7813 1.6881 1.3132 1.3858 1.5696 2.3203 2.2215 1.8212 1.7120 1.4170 1.3993 1.4703 1.2171 1.2138 1.3855 1.2037 1.3228 1.8197 2.0284 1.5509 1.6067 1.4037 1.4295 1.3208 1.4117 1.4217 6.2345 1.4404 1.2316 1.2317 2.2023 1.0941 1.1028 1.1371 1.0648 1.0575 1.0800 1.0881 1.0637 1.0718 1.0854 1.0549 1.0905 1.2598 1.6901 1.0759 6.8146 6.5341 10.4440 11.1067 1.0717 1.0721 1.0713 1.0661 1.0616 1.0608 1.0358 1.0358 1.0608 1.0643 1.0665 1.0649 1.0833 1.0940 1.0930 1.0985 1.0868 1.0872 1.1026 1.1023 1.0981 1.0976 1.1052 1.0977 1.1002 1.1000 1.0859 1.0889 1.0927 1.1005
irintensity: 0.2009 0.1035 0.0088 0.0542 0.0327 0.7855 0.2627 0.0942 0.2966 0.0774 7.4426 0.2858 1.6330 2.5193 0.7476 1.6244 0.4398 0.1855 1.3553 2.4849 1.1235 2.0484 3.8842 1.9823 0.4861 2.6132 19.4785 2.3152 5.5588 5.4453 2.2707 5.7172 2.1652 3.3533 3.0157 0.5028 2.2000 1.9301 1.7743 7.4160 0.9158 19.8308 1.3237 6.5779 43.2919 8.8597 4.3265 43.2509 4.9141 8.0550 3.2616 5.5902 2.5577 1.3573 32.1173 2.6959 11.5107 3.1287 6.0867 5.9819 6.2053 9.0188 0.6077 9.6378 6.8211 14.7214 4.9033 9.3514 10.1502 16.5775 32.3778 9.5079 1.7646 11.6130 4.2048 6.3055 39.4100 9.6527 7.4939 17.4172 20.8623 23.7215 26.2199 14.6148 22.6908 1.1673 12.8609 0.5630 12.4767 2.3307 2.3248 2.4738 22.4967 0.6536 13.9560 37.1587 71.0325 110.4718 27.0232 4.9525 12.1504 1.6371 2.1575 20.8256 17.7459 0.7786 4.0287 23.1834 18.7398 5.1798 14.0473 28.2115 4.8759 1.0003 5.5673 13.4986 7.5538 1.4425 4.0315 19.4916 6.6219 12.6733 10.3514 29.1005 11.8191 3.4419 41.7460 417.8104 42.2095 37.1611 47.1013 221.1654 30.2491 30.0425 17.8974 42.0632 22.0171 27.5689 39.1257 11.4025 12.7424 31.9040 29.5045 5.9308 39.1122 12.2922 13.9760 66.1340 23.3369 40.9874 99.6201 6.7248 3.8073 35.6157 40.0050 14.4177 2.9560 27.0510 26.9078
temp: 298.150 k
press: 1.00000 atm
elementType: 8 8 7 7 6 6 6 6 6 6 6 6 6 6 6 6 6 6 6 6 6 6 6 6 6 1 1 1 1 1 1 1 1 1 1 1 1 1 1 1 1 1 1 1 1 1 1 1 1 1 1 1 1 1 1
symmnumber: 1
zpe: 1237002.1 jmol-1
zpe.correction: 0.471149 hartree
zpe.thermalcorrener: 0.496560 hartree
zpe.thermalcorrenthalpy: 0.497504 hartree
zpe.thermalcorrgfe: 0.412294 hartree
zpe.sumelectzpe: -1076.306814 hartree
zpe.sumelectthermal: -1076.281403 hartree
zpe.sumelectthermalent: -1076.280459 hartree
zpe.sumelectthermalfe: -1076.365669 hartree
dipole: -1.1909 1.5706 -0.4660
dipole: 2.0254
quadrupole: -135.0422 -149.8364 -161.9633
quadrupole: -3.7277 -5.8401 -8.7372
quadrupole: 13.9051 -0.8891 -13.0160 -3.7277 -5.8401 -8.7372
hfenergy: -1076.777963 hartree
pointgroup: C01 [X(C21H30N2O2)]
dipole: 0.4876516 -0.6105376 -0.1562763 debye
polarizability: 250.7403119|-6.7316862|259.1170865|20.9044622|-7.3966206|201.0182563 unknown
InChI: InChI=1S/C21H30N2O2/c1-3-22(4-2)14-7-8-15-23-19(24)16-21(20(23)25)13-9-11-17-10-5-6-12-18(17)21/h5-6,10,12H,3-4,7-9,11,13-16H2,1-2H3
charge 0 multiplicity 1
55 atoms
O  0.964045 0.967241 2.068756
O  1.063374 3.380253 -1.937413
N  0.733435 2.283895 0.127352
N  -4.013768 -0.549694 0.066023
C  2.477892 0.611104 0.07469
C  3.794258 0.597687 0.904399
C  2.597773 1.561142 -1.156601
C  2.028933 -0.817136 -0.3133
C  1.32933 1.261654 0.905629
C  3.79754 -0.487233 1.998396
C  3.696714 -1.88078 1.349007
C  2.58753 -1.971437 0.305894
C  1.402914 2.51213 -1.096659
C  -0.433368 3.077097 0.56578
C  1.007868 -0.983206 -1.287037
C  -1.755135 2.614827 -0.09105
C  2.113939 -3.252008 -0.081237
C  -2.217373 1.209512 0.352497
C  0.5476 -2.260744 -1.662532
C  1.106849 -3.408084 -1.054109
C  -3.511345 0.7785 -0.371917
C  -3.235621 -1.673447 -0.523539
C  -5.479805 -0.701285 -0.142224
C  -3.314617 -2.966835 0.309997
C  -6.31962 0.06104 0.901093
H  4.635943 0.415098 0.205244
H  3.95244 1.599891 1.347077
H  3.519005 2.170695 -1.103221
H  2.61644 1.030664 -2.121717
H  4.725888 -0.415578 2.59547
H  2.944189 -0.320345 2.679126
H  4.664052 -2.125895 0.860854
H  3.53735 -2.656226 2.121963
H  -0.231638 4.130858 0.302394
H  -0.487058 2.976913 1.664768
H  0.562254 -0.102698 -1.766629
H  -1.641252 2.659279 -1.191938
H  -2.532209 3.360679 0.17318
H  2.546984 -4.139325 0.397723
H  -1.412073 0.474053 0.162998
H  -2.401444 1.191864 1.443163
H  -0.238076 -2.360707 -2.419739
H  0.758543 -4.408802 -1.332603
H  -3.344866 0.810432 -1.481614
H  -4.294739 1.529128 -0.15516
H  -3.556811 -1.879774 -1.5785
H  -2.176503 -1.363989 -0.573725
H  -5.780615 -0.385597 -1.175064
H  -5.721654 -1.776712 -0.063555
H  -2.679578 -3.75312 -0.14016
H  -4.344747 -3.362655 0.372092
H  -2.959868 -2.773149 1.336886
H  -6.061211 -0.282959 1.917601
H  -6.145899 1.151626 0.857099
H  -7.398885 -0.111746 0.729795
