program: Gaussian 09
title: 000206611
version: EM64L-G09RevD.01
frameworkgroup: C1[X(CH3ClN2O2)]
method: RPBEPBE
basis: SDD
operation: Freq
keyword: #p
keyword: freq=noraman
keyword: PBEPBE/SDD
title: #p freq=noraman PBEPBE/SDD
converged: NO YES NO NO
title: Mulliken charges:
elementType: Cl O O N N C H H H
charge: 0.126744 -0.187965 -0.155280 -0.214856 0.193580 -0.557712 0.253727 0.258011 0.283751
chargesum: 0.00000
title: Mulliken charges with hydrogens summed into heavy atoms:
elementType: Cl O O N N C
charge: 0.126744 -0.187965 -0.155280 -0.214856 0.193580 0.237777
polarizability: 6.60338214e+01 4.34138585e+00 5.36954559e+01 1.48000792e-01 -1.64586307e+00 2.24217450e+01
1716.lowfreq: -11.7492 -2.2063 0.0009 0.0026 0.0031 7.6634 79.2181 155.7083 214.1177
frequency: 79.2153 155.6947 214.1171 235.3282 338.6514 392.4301 518.3655 644.8411 649.5093 761.7275 1020.6550 1101.5993 1128.3728 1152.6343 1403.8101 1444.1537 1452.5839 1458.5880 2997.4967 3111.6155 3145.3460
redmass: 5.9520 1.1671 5.6812 13.8515 2.7397 12.4951 8.2315 7.5664 7.8390 9.3062 4.5074 1.9524 1.5425 4.6259 1.1805 3.0328 1.2002 1.1745 1.0363 1.0973 1.1026
irintensity: 1.8823 0.0625 34.8898 1.5930 2.2907 12.3065 10.6368 28.6902 7.2800 67.7589 60.1901 35.3350 15.1939 145.3375 40.3398 116.5704 17.0921 27.2813 16.5205 10.7194 1.4107
temp: 298.150 k
press: 1.00000 atm
elementType: 17 8 8 7 7 6 1 1 1
symmnumber: 1
zpe: 140003.4 jmol-1
zpe.correction: 0.053324 hartree
zpe.thermalcorrener: 0.060002 hartree
zpe.thermalcorrenthalpy: 0.060946 hartree
zpe.thermalcorrgfe: 0.022060 hartree
zpe.sumelectzpe: -759.280976 hartree
zpe.sumelectthermal: -759.274298 hartree
zpe.sumelectthermalent: -759.273354 hartree
zpe.sumelectthermalfe: -759.312240 hartree
dipole: -1.9503 3.2498 0.6481
dipole: 3.8452
quadrupole: -45.2622 -39.3439 -41.1078
quadrupole: 0.4884 -0.8717 0.4432
quadrupole: -3.3576 2.5607 0.7968 0.4884 -0.8717 0.4432
hfenergy: -759.3343 hartree
pointgroup: C01 [X(C1H3Cl1N2O2)]
dipole: -1.1508164 -0.9382347 -0.2896906 debye
dipolederiv: -0.3145485 0.2028619 -0.0086118 0.2512339 -0.2685315 0.0121347 -0.2372129 0.1354971 0.0217856 -0.7899582 0.2147703 0.0306753 0.2141154 -0.6047764 -0.0353423 0.0569923 -0.0419345 -0.1798783 -0.4845579 -0.1789102 0.0246983 -0.3956888 -0.7744795 0.0456221 0.0235974 0.0164984 -0.161265 -0.3178276 -0.418691 0.0957498 -0.627025 0.2041008 -0.0879223 0.6024688 -0.1227933 -0.1835734 1.7677406 0.0629269 -0.1729561 0.5031699 1.1415615 -0.0305054 -0.2645018 0.0367507 0.1809147 0.002765 0.1548226 0.018501 0.1085968 0.1261141 0.076523 -0.1468897 0.0948732 0.2483143 0.0887346 -0.0315439 0.0135238 -0.0712854 0.0358762 0.0156241 -0.0444347 -0.0702314 -0.1166158 -0.0204071 -0.0646693 0.0577276 -0.0143631 0.0995755 -0.0191159 0.0558365 -0.0282226 0.0905372 0.0680592 0.0584327 -0.0593079 0.0312463 0.0405593 0.0229819 -0.0458559 -0.0204376 0.0997807 unknown
polarizability: 61.7893073|-7.244073|57.9396979|0.5428441|-1.7808044|22.4220173 unknown
InChI: InChI=1S/CH3ClN2O2/c1-3(2)4(5)6/h1H3
charge 0 multiplicity 1
9 atoms
Cl -1.809671 1.11425 -0.130409
O  1.588353 -0.855418 -0.023402
O  1.079218 1.385691 -0.054113
N  -0.616066 -0.224041 0.345807
N  0.788002 0.152083 0.020702
C  -1.041439 -1.557799 -0.165662
H  -1.033918 -1.618311 -1.269577
H  -2.057407 -1.730521 0.219384
H  -0.355573 -2.306835 0.256571
