program: Gaussian 09
title: 000206582
version: EM64L-G09RevD.01
frameworkgroup: C1[X(C11H15NO3S)]
method: RPBEPBE
basis: SDD
operation: Freq
keyword: #p
keyword: freq=noraman
keyword: PBEPBE/SDD
title: #p freq=noraman PBEPBE/SDD
converged: YES YES NO NO
title: Mulliken charges:
elementType: S O O O N C C C C C C C C C C C H H H H H H H H H H H H H H H
charge: 0.158014 -0.328016 -0.439766 -0.301985 -0.641777 -0.242701 0.293641 -0.670707 0.137415 -0.310625 -0.524912 0.319321 -0.368945 -0.583161 0.147274 -0.654158 0.231403 0.219456 0.269285 0.249222 0.244500 0.281476 0.252966 0.250239 0.250933 0.231531 0.232536 0.223495 0.393759 0.320652 0.359636
chargesum: 0.00000
title: Mulliken charges with hydrogens summed into heavy atoms:
elementType: S O O O N C C C C C C C C C C C
charge: 0.158014 -0.328016 -0.080131 -0.301985 0.072634 0.208159 0.293641 -0.152201 0.137415 -0.066125 -0.243436 0.319321 -0.115978 -0.081990 0.147274 0.033404
polarizability: 2.28711245e+02 -7.62639756e+00 1.63110850e+02 -9.22812367e+00 -2.65716249e+00 8.76262392e+01
1716.lowfreq: -7.3638 -2.5229 -0.0011 0.0004 0.0007 6.8200 20.0964 28.7383 49.1475
frequency: 19.9868 28.5349 49.0973 60.3558 71.0295 87.9212 127.4701 138.5539 140.1434 178.6880 210.3284 242.1782 244.7529 315.6767 346.7172 353.6077 361.6778 362.1205 385.9287 410.8828 430.5612 498.9851 532.5168 584.6031 607.1400 620.7083 629.8416 653.9650 690.6168 698.7950 714.3071 735.9682 764.1594 789.3098 809.1934 869.6585 910.9284 915.8836 932.9214 967.3827 997.1107 1012.7977 1037.0944 1056.7097 1064.1044 1076.7556 1084.6248 1133.4109 1155.0630 1176.0166 1194.3667 1219.2304 1241.2109 1243.5640 1268.7316 1286.0474 1311.7406 1354.0296 1367.7799 1397.4199 1397.8165 1426.9542 1438.7407 1459.2666 1469.3467 1471.0137 1484.3252 1489.4398 1563.5223 1600.5601 1607.9000 1632.8036 2961.1430 2988.1221 3006.4767 3011.8094 3028.2422 3068.7923 3082.9026 3086.3014 3099.8712 3120.4353 3156.2847 3177.2467 3449.5776 3585.5060 3641.3261
redmass: 4.3230 5.1745 3.0547 3.0214 4.6868 5.2805 4.4670 4.9454 4.5954 6.9948 5.3568 1.3965 1.5852 3.5888 4.8894 3.8151 1.2954 3.6886 5.6210 5.0476 3.1413 4.8070 2.4314 4.2759 4.3008 1.4979 4.8383 3.9941 3.3986 4.7058 1.2046 3.3031 4.6787 1.1200 1.5375 2.3877 4.5721 1.4875 1.3454 2.7380 1.7955 1.4750 1.2579 2.4778 2.2410 2.1242 2.2680 1.5542 1.2346 1.1982 2.3194 1.2491 1.2405 2.4530 1.2228 2.0706 1.2619 2.7766 1.4640 5.3074 1.2253 3.8037 1.0975 1.0876 1.2520 1.0397 1.0477 2.1344 1.9023 5.5744 2.6953 6.2744 1.0558 1.0355 1.0569 1.0628 1.1008 1.1061 1.0989 1.1073 1.1036 1.0913 1.0873 1.0968 1.0509 1.0660 1.0999
irintensity: 0.1126 0.1484 1.7825 0.4806 0.9753 7.4365 0.7506 0.3733 1.0129 0.4597 12.1383 2.6786 2.9514 0.4447 3.0443 9.7370 106.0505 38.6022 3.2200 2.8695 17.1199 0.4839 0.3327 17.0352 2.6053 120.4913 6.8719 2.8892 42.8696 32.2765 87.4191 22.1299 11.0505 10.4385 48.8301 23.4376 10.1495 21.9544 4.3402 56.0287 13.3010 6.8126 2.4126 8.0168 22.6188 3.5956 25.2320 272.5213 61.3601 3.3349 188.1309 7.7457 0.9779 29.7334 32.0019 5.2086 8.6623 96.9638 4.8556 38.7223 22.6771 246.3201 17.1473 3.7969 64.3506 15.6388 7.9976 79.4474 135.6543 54.4441 207.8438 75.1560 36.3331 31.5312 39.1018 12.5886 34.5177 5.3743 29.4133 24.7842 41.4479 11.5342 11.3831 7.8814 164.7148 47.7695 76.5973
temp: 298.150 k
press: 1.00000 atm
elementType: 16 8 8 8 7 6 6 6 6 6 6 6 6 6 6 6 1 1 1 1 1 1 1 1 1 1 1 1 1 1 1
symmnumber: 1
zpe: 644049.3 jmol-1
zpe.correction: 0.245305 hartree
zpe.thermalcorrener: 0.262549 hartree
zpe.thermalcorrenthalpy: 0.263493 hartree
zpe.thermalcorrgfe: 0.198034 hartree
zpe.sumelectzpe: -1105.445498 hartree
zpe.sumelectthermal: -1105.428254 hartree
zpe.sumelectthermalent: -1105.427310 hartree
zpe.sumelectthermalfe: -1105.492769 hartree
dipole: -4.9863 -4.0788 1.1017
dipole: 6.5355
quadrupole: -87.4822 -104.2188 -105.7867
quadrupole: -0.2564 -5.5519 -3.2918
quadrupole: 11.6804 -5.0563 -6.6241 -0.2564 -5.5519 -3.2918
hfenergy: -1105.690803 hartree
pointgroup: C01 [X(C11H15N1O3S1)]
dipole: 1.9321183 1.6551922 0.3724264 debye
polarizability: 229.6525578|-5.5794559|162.5751296|2.2713488|4.588694|87.2206467 unknown
InChI: InChI=1S/C11H15NO3S/c1-2-16-6-5-15-10-4-3-8(13)7-9(10)11(12)14/h3-4,7,13H,2,5-6,12H2,1H3
charge 0 multiplicity 1
31 atoms
S  3.403265 0.269707 -0.81617
O  0.521814 0.492196 0.235087
O  -5.082994 0.397098 -0.420114
O  -1.574903 -3.203692 0.095524
N  0.509235 -2.190306 0.085362
C  1.246429 1.769757 0.199728
C  -0.87838 0.488152 0.04319
C  2.711437 1.459012 0.485726
C  -1.529331 -0.780235 -0.005354
C  -1.631102 1.682039 -0.080769
C  -2.936705 -0.805384 -0.155629
C  -3.684201 0.383035 -0.268546
C  -3.029466 1.633612 -0.237781
C  5.22197 0.303896 -0.268547
C  -0.866316 -2.143627 0.071003
C  6.037126 -0.642573 -1.161219
H  1.11956 2.244279 -0.794103
H  0.850303 2.448954 0.982511
H  2.822136 0.998382 1.482302
H  3.294566 2.396664 0.446996
H  -1.140068 2.658761 -0.057258
H  -3.401476 -1.800026 -0.180354
H  -3.619173 2.549588 -0.335295
H  5.582431 1.344392 -0.352654
H  5.263779 -0.008427 0.789823
H  5.66972 -1.681053 -1.083309
H  5.984779 -0.337311 -2.221273
H  7.099255 -0.631942 -0.854753
H  1.074686 -1.336584 0.062287
H  0.94524 -3.111201 0.103922
H  -5.440413 -0.525165 -0.432431
