program: Gaussian 09
title: 000206581
version: EM64L-G09RevD.01
frameworkgroup: C1[X(C15H15NO4S)]
method: RPBEPBE
basis: SDD
operation: Freq
keyword: #p
keyword: freq=noraman
keyword: PBEPBE/SDD
title: #p freq=noraman PBEPBE/SDD
converged: YES YES NO NO
title: Mulliken charges:
elementType: S O O O O N C C C C C C C C C C C C C C C H H H H H H H H H H H H H H H
charge: 0.656965 -0.303905 -0.629634 -0.440874 -0.314985 -0.637323 -0.652126 -0.245502 0.278695 -0.134767 0.143478 -0.312462 -0.526710 -0.239770 -0.260042 0.320755 -0.374329 0.141457 -0.211533 -0.206591 -0.222674 0.258577 0.314393 0.234536 0.217911 0.240858 0.285225 0.309788 0.244338 0.251888 0.241198 0.237341 0.236880 0.420665 0.318367 0.359911
chargesum: 0.00000
title: Mulliken charges with hydrogens summed into heavy atoms:
elementType: S O O O O N C C C C C C C C C C C C C C C
charge: 0.656965 -0.303905 -0.629634 -0.080963 -0.314985 0.101709 -0.079156 0.206945 0.278695 -0.134767 0.143478 -0.071604 -0.241485 0.070018 -0.015705 0.320755 -0.122441 0.141457 0.029666 0.030750 0.014206
polarizability: 3.19532679e+02 3.58147523e-01 2.11673732e+02 -1.09279839e+01 6.14395720e+00 1.00598344e+02
1716.lowfreq: -9.9490 -2.3432 0.0006 0.0008 0.0016 5.0266 18.8569 24.9377 44.0797
frequency: 18.8135 24.8239 44.0746 52.9667 67.2092 88.4115 101.0918 121.9808 139.5111 172.8967 176.7160 200.0928 218.8729 234.6778 279.7311 307.4575 333.9574 340.6666 362.4354 367.4373 376.7194 398.6097 403.6937 431.3843 436.8490 474.7241 490.7096 533.5088 558.6841 592.1592 605.7284 606.4567 641.1257 653.9604 698.5166 698.8956 702.7831 729.7952 755.6133 764.3783 782.6904 804.0353 818.5758 856.1291 860.0348 910.7588 916.8569 931.4790 933.4608 957.1567 979.3519 986.8863 1001.9904 1008.4842 1010.2059 1034.1619 1044.7009 1061.6301 1073.6430 1074.9937 1136.6757 1155.3836 1167.7044 1171.4493 1175.8490 1190.3336 1202.2470 1240.8546 1273.0579 1287.2028 1299.5512 1361.6619 1366.4379 1383.2509 1398.3022 1400.8682 1424.6384 1432.1038 1454.2480 1467.0990 1490.8065 1550.3859 1581.9285 1600.6286 1603.1351 1614.6829 1634.4295 2946.3588 3003.0611 3042.0259 3117.8320 3123.0893 3125.2818 3135.2015 3139.0529 3152.6401 3153.4345 3168.9835 3175.6143 3403.5215 3585.8108 3610.1402
redmass: 6.7743 6.0957 5.1914 5.8268 4.8715 7.0777 6.4081 5.1550 5.7639 4.9008 7.1261 6.2256 6.3270 2.6605 4.2606 8.1438 4.4061 4.4396 6.3537 1.1150 4.2555 6.0737 2.8910 3.2077 7.4352 3.8301 5.3067 2.6458 4.3698 3.8570 6.3663 4.2369 1.6512 6.7905 2.4120 4.1664 3.2498 3.3267 1.4447 4.2736 9.6523 1.5735 1.1502 1.2556 2.4124 4.5664 1.4948 1.3612 1.3547 2.7165 6.0610 1.3649 1.5691 1.4960 2.9432 1.7753 2.1178 2.4659 1.8994 2.0311 1.5581 1.2347 1.1707 1.0800 1.1081 2.3039 1.3375 2.5240 1.2037 2.0767 1.3147 2.2599 1.7414 8.9726 2.2036 1.6579 3.9374 2.1878 2.0483 1.1900 2.3981 2.5408 5.8410 6.5825 6.8266 2.3358 3.6485 1.0554 1.1056 1.0575 1.0912 1.0880 1.0890 1.1094 1.0898 1.0874 1.0955 1.1012 1.0967 1.0579 1.0660 1.0931
irintensity: 0.0237 0.1593 0.6870 0.3039 1.5091 0.9900 8.9406 0.4691 1.4572 3.5517 1.1433 22.6002 5.6256 0.5359 18.6265 3.3007 1.4956 3.9346 0.3423 145.9057 2.9178 11.4342 0.1082 11.2673 10.5491 9.5480 5.6308 4.3003 20.9760 19.0186 0.0228 1.9647 41.6802 0.5608 28.5794 21.2254 34.0277 19.6385 78.1038 29.3191 50.7192 52.6419 165.5290 1.4355 9.3909 16.7345 17.4998 11.8666 6.0089 61.0995 3.3392 0.9694 7.7857 1.3704 6.5089 37.1297 10.8942 15.5231 33.2887 35.2198 271.6830 72.0139 2.8758 4.5121 7.4136 190.5648 7.7104 31.2206 8.0834 2.4941 3.2465 69.6696 28.4441 2.6180 6.6015 40.3684 271.2497 15.1293 26.9540 46.8045 94.7507 83.0671 13.3558 16.7814 11.6238 244.7564 172.5879 38.1065 23.5542 7.9294 13.9218 4.1131 8.2325 3.2403 1.0297 14.4052 18.7534 36.1892 7.9386 525.4096 50.1569 88.0405
temp: 298.150 k
press: 1.00000 atm
elementType: 16 8 8 8 8 7 6 6 6 6 6 6 6 6 6 6 6 6 6 6 6 1 1 1 1 1 1 1 1 1 1 1 1 1 1 1
symmnumber: 1
zpe: 712988.1 jmol-1
zpe.correction: 0.271563 hartree
zpe.thermalcorrener: 0.291548 hartree
zpe.thermalcorrenthalpy: 0.292492 hartree
zpe.thermalcorrgfe: 0.221131 hartree
zpe.sumelectzpe: -1332.710015 hartree
zpe.sumelectthermal: -1332.690030 hartree
zpe.sumelectthermalent: -1332.689086 hartree
zpe.sumelectthermalfe: -1332.760447 hartree
dipole: -7.1238 -6.4882 0.8973
dipole: 9.6773
quadrupole: -113.5741 -130.5932 -133.0478
quadrupole: -0.4144 -4.1455 1.4443
quadrupole: 12.1643 -4.8548 -7.3094 -0.4144 -4.1455 1.4443
hfenergy: -1332.9815781 hartree
pointgroup: C01 [X(C15H15N1O4S1)]
dipole: 2.7592392 -2.5755237 0.4992246 debye
polarizability: 319.647625|-5.0337715|197.3020247|-8.118682|-37.8459467|114.8551062 unknown
InChI: InChI=1S/C15H15NO4S/c16-15(18)13-10-11(17)6-7-14(13)20-8-9-21(19)12-4-2-1-3-5-12/h1-7,10,17H,8-9,16H2
charge 0 multiplicity 1
36 atoms
S  1.915221 0.17618 0.954721
O  -0.926349 -0.44697 0.008531
O  1.502608 1.526712 0.048579
O  -6.530572 -0.73796 0.627061
O  -3.427779 2.914884 -0.834648
N  -1.235199 2.240189 -0.561192
C  1.303202 -1.311417 -0.155346
C  -0.133567 -1.664075 0.191547
C  -2.330129 -0.532335 0.176475
C  3.771702 -0.045103 0.570981
C  -3.095994 0.640926 -0.083344
C  -2.969462 -1.73155 0.5789
C  -4.501893 0.561664 0.06723
C  4.329079 0.864625 -0.34053
C  4.526799 -1.034005 1.228898
C  -5.136676 -0.630038 0.467633
C  -4.368538 -1.784712 0.727935
C  -2.584374 2.004657 -0.523588
C  5.710506 0.761293 -0.627212
C  5.907954 -1.12613 0.932293
C  6.495257 -0.232029 0.005243
H  1.984041 -2.15681 0.03431
H  1.416346 -0.921589 -1.179716
H  -0.492362 -2.463036 -0.491573
H  -0.222776 -2.029201 1.23622
H  -2.390786 -2.636877 0.7826
H  -5.057577 1.48215 -0.15648
H  3.680066 1.626901 -0.790274
H  4.070277 -1.711676 1.960381
H  -4.870076 -2.705356 1.039508
H  6.171822 1.456754 -1.336473
H  6.520685 -1.886141 1.428887
H  7.565569 -0.304825 -0.216703
H  -0.489549 1.580838 -0.300154
H  -0.95406 3.18255 -0.834233
H  -6.970815 0.122611 0.416831
