program: Gaussian 09
title: 000206571
version: EM64L-G09RevD.01
frameworkgroup: C1[X(C13H19NO4S)]
method: RPBEPBE
basis: SDD
operation: Freq
keyword: #p
keyword: freq=noraman
keyword: PBEPBE/SDD
title: #p freq=noraman PBEPBE/SDD
converged: YES YES NO NO
title: Mulliken charges:
elementType: S O O O O N C C C C C C C C C C C C C H H H H H H H H H H H H H H H H H H H
charge: 0.177958 -0.343056 -0.272122 -0.288539 -0.245650 -0.647075 -0.362610 -0.256863 0.306292 -0.694795 0.113934 -0.336668 -0.498247 0.359483 -0.374379 0.149530 -0.199676 -0.837926 -0.510778 0.236254 0.227862 0.207733 0.210398 0.244090 0.259218 0.245464 0.306167 0.241664 0.187015 0.235672 0.254129 0.256143 0.258717 0.380119 0.322538 0.237102 0.251219 0.199684
chargesum: 0.00000
title: Mulliken charges with hydrogens summed into heavy atoms:
elementType: S O O O O N C C C C C C C C C C C C C
charge: 0.177958 -0.343056 -0.272122 -0.288539 -0.245650 0.055582 0.101506 0.161267 0.306292 -0.191487 0.113934 -0.091204 -0.192080 0.359483 -0.132715 0.149530 0.223012 -0.068937 0.177228
polarizability: 2.73038268e+02 -1.29669195e+01 1.80210219e+02 3.50236847e-01 1.41243752e+00 1.12241848e+02
1716.lowfreq: -8.5893 -0.0009 0.0005 0.0006 1.7560 4.1468 15.7359 22.4718 31.2443
frequency: 15.7250 21.8735 31.2425 40.8455 52.1857 63.3129 76.2122 92.9394 105.1601 127.5448 132.5601 140.0604 149.8088 158.8773 178.8920 191.2486 202.8380 245.4678 255.4032 310.1893 348.2392 363.5996 375.5468 406.7097 419.3248 430.2205 459.8098 533.7399 567.2398 585.5138 611.7866 616.1644 649.7378 685.5663 700.0395 701.3621 716.1903 750.1230 764.8855 766.4723 792.8998 851.3328 857.5522 877.4654 904.8441 941.0803 950.2275 962.1016 974.3276 981.8906 1048.3644 1063.5152 1065.0220 1071.6822 1075.6710 1101.0828 1105.3529 1124.3425 1154.3329 1162.5298 1165.9999 1192.5702 1229.4155 1236.5985 1247.8682 1265.0173 1265.8441 1286.9191 1314.2369 1335.9773 1346.2791 1372.0378 1375.8463 1393.4250 1423.4591 1432.1838 1438.8944 1450.7245 1453.2738 1462.4723 1463.3964 1469.3369 1476.0261 1479.1974 1491.1406 1569.0035 1578.0952 1611.5366 1635.5285 2897.5633 2954.2967 2957.8043 3000.3749 3002.7854 3008.5573 3014.2095 3047.1533 3060.9587 3069.1716 3086.9496 3116.3984 3130.0248 3130.3676 3150.6068 3165.3429 3172.4097 3451.1601 3645.7791
redmass: 4.4363 3.3566 4.8926 6.1988 3.2811 4.3678 3.6672 2.0992 3.9253 2.9672 2.0224 1.2874 2.1015 2.0261 3.9566 5.4593 4.3857 5.8727 2.9915 3.9127 4.4214 5.3120 3.8384 5.5853 5.7070 3.2219 3.9616 2.3404 4.4766 5.0966 1.5810 4.7608 5.7208 1.8252 3.1266 2.1309 6.3244 1.1459 4.2731 6.2299 1.6120 1.2296 6.6904 5.4267 1.3998 5.6844 1.4170 1.1779 1.2479 6.9560 4.0906 1.6571 2.5210 2.2470 1.6855 2.0225 1.6258 1.9836 1.4961 1.7130 1.1881 1.7301 5.7906 1.2042 1.1813 1.4289 1.3006 1.0878 1.3124 3.3065 1.1389 1.4663 1.3518 3.5945 2.4797 1.4309 1.0805 1.0583 1.0534 1.0965 1.1202 1.4671 1.2678 1.0886 1.2114 3.1348 2.3218 2.9492 7.0383 1.0642 1.0550 1.0385 1.0558 1.0340 1.0602 1.1036 1.0982 1.1034 1.0946 1.1063 1.1056 1.1023 1.1027 1.0874 1.0914 1.0953 1.0497 1.1010
irintensity: 1.0631 2.1712 1.2177 1.0842 4.1364 2.0376 6.0353 0.2699 0.1826 6.3411 0.5750 0.6334 0.3693 1.5399 0.0248 1.3016 6.5346 10.0184 2.3922 17.0260 11.7128 5.0412 1.5955 3.9161 1.4567 8.6044 1.7661 2.1517 12.0640 12.7798 159.9305 15.7989 2.2316 81.7641 6.3261 7.4391 6.4224 8.7807 8.6502 27.1302 53.9248 1.8353 166.8037 17.4652 1.7472 324.2153 23.6822 5.3998 24.3531 87.0822 3.5926 40.9074 22.5415 1.6772 10.9224 38.8984 57.4512 155.8609 136.3215 27.6289 2.6740 147.5341 14.3231 5.5463 0.8521 62.2454 41.1432 0.3006 10.5380 161.9303 1.1194 50.4503 41.3859 14.3409 100.2012 18.0449 3.1754 21.8244 10.5041 39.5944 6.4150 125.0012 91.6690 6.2484 9.4746 100.1668 135.3188 176.4815 83.2181 62.6108 34.5165 60.2068 8.8903 21.6366 41.1612 26.2147 35.6601 2.9874 36.3711 38.9219 23.1035 12.9680 29.8174 20.2232 6.2137 14.2371 113.2836 87.4062
temp: 298.150 k
press: 1.00000 atm
elementType: 16 8 8 8 8 7 6 6 6 6 6 6 6 6 6 6 6 6 6 1 1 1 1 1 1 1 1 1 1 1 1 1 1 1 1 1 1 1
symmnumber: 1
zpe: 799311.8 jmol-1
zpe.correction: 0.304442 hartree
zpe.thermalcorrener: 0.326014 hartree
zpe.thermalcorrenthalpy: 0.326958 hartree
zpe.thermalcorrgfe: 0.249908 hartree
zpe.sumelectzpe: -1259.001777 hartree
zpe.sumelectthermal: -1258.980205 hartree
zpe.sumelectthermalent: -1258.979261 hartree
zpe.sumelectthermalfe: -1259.056311 hartree
dipole: -3.4453 -5.0643 -0.5219
dipole: 6.1473
quadrupole: -123.8799 -127.0080 -121.8244
quadrupole: -14.5977 -21.2452 -0.1966
quadrupole: 0.3575 -2.7706 2.4131 -14.5977 -21.2452 -0.1966
hfenergy: -1259.3062188 hartree
pointgroup: C01 [X(C13H19N1O4S1)]
dipole: -1.2727392 -2.0058102 -0.4540776 debye
polarizability: 273.9518097|-8.795481|177.8055586|-2.3569551|9.9734307|113.732967 unknown
InChI: InChI=1S/C13H19NO4S/c1-16-9-18-10-4-5-12(11(8-10)13(14)15)17-6-3-7-19-2/h4-5,8H,3,6-7,9,14H2,1-2H3
charge 0 multiplicity 1
38 atoms
S  -6.631793 -1.086624 -0.434301
O  -1.544877 0.252299 0.085818
O  4.070204 -0.18378 0.543767
O  0.973689 3.649811 0.641701
O  6.171393 -1.21099 0.290055
N  -1.197997 2.890273 0.360151
C  -3.843544 -0.454015 -0.15354
C  -2.389952 -0.940566 -0.096886
C  -0.142554 0.083149 0.187602
C  -4.823679 -1.629302 -0.328755
C  0.659849 1.253702 0.376592
C  0.46929 -1.187068 0.112002
C  2.057369 1.096291 0.483072
C  2.672599 -0.172017 0.406976
C  1.871309 -1.32454 0.220489
C  0.161323 2.685647 0.470954
C  4.776937 -1.459197 0.274306
C  -6.920878 -0.60206 1.362892
C  6.631616 -0.330774 -0.799757
H  -3.962619 0.25319 -0.994447
H  -4.071013 0.097885 0.777642
H  -2.233343 -1.636199 0.753462
H  -2.104364 -1.4538 -1.03828
H  -4.739529 -2.359593 0.49722
H  -4.644436 -2.163279 -1.279066
H  -0.131459 -2.089571 -0.029368
H  2.659616 1.998396 0.628981
H  2.307369 -2.32685 0.171485
H  4.424483 -1.846497 -0.711312
H  4.584368 -2.181568 1.088123
H  -6.677517 -1.447072 2.027491
H  -6.330921 0.286493 1.636231
H  -7.993492 -0.368127 1.448198
H  -1.829009 2.096522 0.221056
H  -1.53598 3.849733 0.417875
H  7.728345 -0.311836 -0.719547
H  6.220954 0.686115 -0.677521
H  6.333044 -0.738777 -1.78786
