program: Gaussian 09
title: 000206555
version: EM64L-G09RevD.01
frameworkgroup: C1[X(C17H27NO)]
method: RPBEPBE
basis: SDD
operation: Freq
keyword: #p
keyword: freq=noraman
keyword: PBEPBE/SDD
title: #p freq=noraman PBEPBE/SDD
converged: YES YES NO NO
title: Mulliken charges:
elementType: O N C C C C C C C C C C C C C C C C C H H H H H H H H H H H H H H H H H H H H H H H H H H H
charge: -0.277299 -0.048807 0.246245 -0.503856 -0.497002 -0.453040 -0.423731 0.448680 -0.366393 -0.635811 -0.562969 -0.423116 -0.700132 0.349781 -0.247223 -0.391428 -0.250173 -0.395240 -0.678986 0.205405 0.241336 0.182800 0.237569 0.204875 0.199354 0.232695 0.173901 0.191813 0.230398 0.225654 0.225820 0.183493 0.262516 0.231371 0.206897 0.211039 0.216831 0.218700 0.248669 0.198402 0.199515 0.217447 0.218238 0.209453 0.226458 0.209848
chargesum: 0.00000
title: Mulliken charges with hydrogens summed into heavy atoms:
elementType: O N C C C C C C C C C C C C C C C C C
charge: -0.277299 -0.048807 0.246245 -0.057114 -0.076633 -0.048811 -0.017135 0.448680 0.055818 -0.000844 -0.300452 -0.191745 -0.065365 0.349781 -0.028523 -0.142759 0.147745 0.040446 -0.033228
polarizability: 2.54756569e+02 -1.79198619e+00 1.59934141e+02 1.61695908e-01 1.37645482e+01 1.72970626e+02
1716.lowfreq: -9.3941 -5.4811 -0.0004 0.0001 0.0006 4.5283 18.5847 35.1552 43.4981
frequency: 18.0171 34.1473 43.4433 66.6339 67.3821 86.8065 94.0228 124.1656 132.0877 140.3485 152.9817 203.2996 214.7453 219.9586 232.7221 242.1760 242.7741 277.4790 281.6201 291.2106 308.2158 319.4894 333.9279 356.2320 446.1238 454.1612 498.7380 508.3073 565.4918 593.4247 625.1582 642.8859 706.9410 716.8377 747.6740 767.6427 784.7049 804.9720 820.9039 863.0907 871.0171 879.1196 887.0257 898.2183 898.4383 905.2389 927.3468 962.7501 966.9741 976.5341 985.3577 1005.7730 1012.9055 1044.2686 1046.6198 1054.1026 1064.7003 1096.4676 1104.3872 1110.0688 1114.3413 1135.2105 1140.1228 1142.5463 1148.4060 1177.2923 1182.7451 1200.8504 1209.2862 1230.3722 1230.8499 1238.6755 1245.1917 1264.6741 1285.9167 1289.0010 1291.5678 1302.6433 1310.3222 1319.4914 1335.8997 1352.1584 1357.4027 1375.2021 1387.9986 1391.2847 1395.3101 1431.6690 1432.1530 1452.8376 1462.1510 1465.2846 1472.5297 1474.7261 1475.4490 1476.8167 1477.9524 1480.7132 1481.1604 1485.6268 1488.1129 1490.9667 1498.2474 1582.2838 1616.9551 2827.3256 2840.3976 2871.8628 2941.0484 2951.7512 2970.9144 2976.2357 2977.7052 2998.0611 3003.7245 3006.1096 3007.5956 3013.3897 3017.7299 3026.7390 3036.4279 3051.4381 3069.2642 3070.4538 3070.7757 3077.4477 3080.0639 3082.8289 3126.1931 3151.9924 3157.6065 3168.3727
redmass: 3.5955 3.2650 3.0042 2.6379 3.5414 2.0378 1.9669 2.4892 2.2777 3.1689 2.8012 2.5148 2.7447 1.2597 1.2194 2.2978 1.4005 2.8408 3.2761 2.6571 2.3311 3.5871 3.1015 2.7268 3.0287 3.2360 3.1877 3.5853 3.5926 6.1037 4.5721 3.6036 2.0489 2.9634 1.1795 1.1227 1.5087 2.9460 3.9510 1.5068 1.5059 1.8677 1.8881 1.5816 1.1655 1.7325 2.2367 1.3285 1.9849 2.3611 4.5269 3.0466 1.7379 2.1182 2.0099 2.7441 2.3508 1.6979 1.5536 1.5411 1.9672 2.2019 2.5351 1.4506 1.5559 2.0052 1.2157 1.7947 2.2008 1.2623 1.8209 1.5859 1.8431 1.6103 1.1035 1.2724 1.3565 1.2464 1.3561 1.4643 1.4611 1.4823 1.4575 2.0665 2.4727 1.2124 1.3010 1.3736 2.1589 1.0981 1.0895 1.0559 1.1736 1.2515 1.4040 1.0574 1.0515 1.0425 1.1144 1.0870 1.0861 1.0965 1.1007 5.9127 6.6170 1.0684 1.0611 1.0709 1.0549 1.0595 1.0358 1.0629 1.0362 1.1062 1.0602 1.0848 1.0747 1.0710 1.0873 1.0864 1.1001 1.1014 1.1010 1.0992 1.1009 1.1045 1.1029 1.0988 1.0863 1.0920 1.0906 1.0963
irintensity: 0.5381 0.2032 0.9241 0.0542 0.3905 0.2041 0.1928 2.3233 0.5888 0.7136 1.1703 0.2428 3.6562 0.5453 0.0215 1.0139 0.6075 3.0096 1.3050 3.0977 0.1690 0.6761 0.6130 1.8466 1.3954 1.1486 1.4253 2.1914 2.6266 4.6555 0.4946 0.5383 27.8669 10.3085 12.7467 17.1536 27.2291 14.6552 5.8364 5.4014 3.6047 0.5744 18.7055 7.2898 2.2355 10.0452 0.7780 1.0446 12.9145 16.5282 1.1040 87.7353 44.3124 9.1716 11.7707 7.8028 5.1204 15.7260 7.2743 9.1202 2.4229 10.8084 9.4044 0.2772 5.2937 83.4751 30.3945 6.9994 10.4649 0.3375 84.1958 7.2424 18.1079 33.3169 0.0159 0.2569 25.0910 4.0006 0.1075 14.7167 8.2998 5.7202 1.0569 2.4887 13.3211 11.4922 38.6351 4.3956 25.1509 16.8909 4.6178 20.9191 26.4456 8.4493 27.9542 6.4828 7.3949 13.2757 2.8682 0.5926 10.5209 17.0156 15.1480 73.4866 113.1099 60.2881 169.6671 133.9840 40.8543 28.9964 54.9380 22.9106 40.7903 29.6921 22.9970 1.0056 38.0726 53.8142 50.2587 44.9733 19.9559 0.0805 82.9685 35.6383 39.6326 31.0282 85.0346 43.9193 10.1421 26.3254 4.6207 13.4788
temp: 298.150 k
press: 1.00000 atm
elementType: 8 7 6 6 6 6 6 6 6 6 6 6 6 6 6 6 6 6 6 1 1 1 1 1 1 1 1 1 1 1 1 1 1 1 1 1 1 1 1 1 1 1 1 1 1 1
symmnumber: 1
zpe: 1059305.9 jmol-1
zpe.correction: 0.403468 hartree
zpe.thermalcorrener: 0.424260 hartree
zpe.thermalcorrenthalpy: 0.425204 hartree
zpe.thermalcorrgfe: 0.352751 hartree
zpe.sumelectzpe: -792.469990 hartree
zpe.sumelectthermal: -792.449198 hartree
zpe.sumelectthermalent: -792.448254 hartree
zpe.sumelectthermalfe: -792.520708 hartree
dipole: -0.8722 0.9181 0.1204
dipole: 1.2720
quadrupole: -97.8866 -121.2020 -114.5269
quadrupole: -0.2491 -2.9244 3.9199
quadrupole: 13.3186 -9.9969 -3.3217 -0.2491 -2.9244 3.9199
hfenergy: -792.8734583 hartree
pointgroup: C01 [X(C17H27N1O1)]
dipole: -0.3421988 0.3320386 0.1519893 debye
polarizability: 254.7288547|-2.5005033|153.1983102|0.2866013|7.4338247|179.7341715 unknown
InChI: InChI=1S/C17H27NO/c1-4-9-17(10-11-18(3)14-17)15-7-6-8-16(13-15)19-12-5-2/h6-8,13H,4-5,9-12,14H2,1-3H3
charge 0 multiplicity 1
46 atoms
O  -3.147555 -0.257257 -0.645996
N  3.516031 -1.876531 -0.273174
C  1.770945 -0.152254 -0.292064
C  1.784547 -1.026977 -1.600147
C  2.935525 -0.786659 0.557627
C  2.128427 1.327347 -0.692355
C  3.227618 -1.552141 -1.685666
C  0.399949 -0.158943 0.407432
C  2.251658 2.351115 0.458555
C  4.907183 -2.218198 0.041216
C  -0.782586 -0.225401 -0.364614
C  0.270507 -0.019519 1.818264
C  2.660877 3.749175 -0.055423
C  -2.06061 -0.173349 0.242226
C  -1.003022 0.030509 2.420698
C  -2.183761 -0.046657 1.647323
C  -4.505834 -0.22481 -0.075912
C  -5.488309 -0.35192 -1.242803
C  -6.954566 -0.329501 -0.758253
H  1.489721 -0.44696 -2.493265
H  1.0960 -1.882707 -1.490177
H  3.701629 -0.006239 0.790636
H  2.586238 -1.206095 1.51816
H  1.350783 1.687092 -1.397308
H  3.084826 1.306569 -1.256267
H  3.320419 -2.452964 -2.319833
H  3.916105 -0.770226 -2.102122
H  2.999473 2.001626 1.199093
H  1.287636 2.421236 0.996383
H  5.234444 -3.070502 -0.581528
H  4.990627 -2.522741 1.10042
H  5.621563 -1.370285 -0.128102
H  -0.743728 -0.325598 -1.453756
H  1.162041 0.05412 2.449192
H  3.64597 3.718611 -0.558911
H  1.923883 4.13386 -0.785728
H  2.726874 4.478768 0.772651
H  -1.083455 0.133319 3.509057
H  -3.161224 -0.007285 2.136219
H  -4.660649 0.730288 0.46988
H  -4.631322 -1.064467 0.640479
H  -5.306464 0.475522 -1.953759
H  -5.277613 -1.292662 -1.784692
H  -7.191832 0.615142 -0.233483
H  -7.649843 -0.422929 -1.611059
H  -7.162125 -1.16442 -0.062615
