program: Gaussian 09
title: 000206511
version: EM64L-G09RevD.01
frameworkgroup: C1[X(C14H21N3O2)]
method: RPBEPBE
basis: SDD
operation: Freq
keyword: #p
keyword: freq=noraman
keyword: PBEPBE/SDD
title: #p freq=noraman PBEPBE/SDD
converged: NO YES NO NO
title: Mulliken charges:
elementType: O O N N N C C C C C C C C C C C C C C H H H H H H H H H H H H H H H H H H H H H
charge: -0.176441 -0.200607 -0.190386 -0.406127 -0.425852 -0.479466 -0.315653 -0.328320 0.205763 -0.667389 -0.667180 -0.500399 0.211733 0.461183 -0.363937 -0.423505 -0.223571 -0.193429 -0.275460 0.250777 0.250427 0.211755 0.203949 0.230787 0.209512 0.223069 0.221099 0.215165 0.227827 0.212351 0.214727 0.374912 0.231540 0.238476 0.336906 0.226090 0.221755 0.215187 0.219300 0.223436
chargesum: 0.00000
title: Mulliken charges with hydrogens summed into heavy atoms:
elementType: O O N N N C C C C C C C C C C C C C C
charge: -0.176441 -0.200607 -0.190386 -0.031216 -0.088946 0.021739 0.100050 0.111979 0.205763 -0.008057 -0.012275 -0.030384 0.211733 0.461183 -0.137847 -0.201750 -0.008384 0.025871 -0.052024
polarizability: 2.48927845e+02 9.29575766e+00 1.87862849e+02 3.42009666e+00 -4.79611308e+00 1.15972122e+02
1716.lowfreq: -7.7862 -5.4426 -2.2068 -0.0006 -0.0004 -0.0003 19.4902 23.2571 32.0828
frequency: 19.3086 23.1734 32.0358 42.2533 54.5763 66.6870 74.3045 87.3315 103.3015 128.1308 165.3196 176.3491 192.2855 205.6207 225.5153 246.2546 277.1803 279.8602 292.1112 346.7102 397.6114 410.3034 445.3428 472.1474 506.1068 507.2110 527.2981 530.4838 555.5963 577.0194 604.8982 614.6436 692.0121 720.9104 755.1803 758.4035 795.1056 802.8727 814.1750 840.0624 869.3470 888.6977 892.9589 934.7573 953.7221 960.3782 973.0445 977.0582 986.1015 996.8683 1000.9631 1023.3944 1061.9582 1073.9572 1082.8536 1088.2483 1106.9534 1138.1344 1157.5576 1166.5952 1169.7494 1186.1715 1194.5217 1198.9061 1200.4944 1245.1748 1273.5678 1280.5301 1287.3161 1325.2358 1327.0004 1343.3404 1364.3178 1369.7613 1387.3282 1393.0302 1395.4023 1430.3721 1446.5089 1454.7098 1466.8711 1469.4920 1470.6087 1475.4348 1479.6357 1484.2769 1485.2034 1492.9417 1517.1384 1584.9416 1628.3391 1635.0002 1682.8948 2892.2119 2903.8520 2909.5967 2919.4999 2966.5657 2986.2181 2987.7816 3026.4043 3048.1125 3049.9882 3081.7406 3084.4664 3088.2778 3090.6164 3115.8203 3121.2294 3137.7990 3145.9182 3164.4113 3165.4762 3508.9044
redmass: 3.9090 3.4213 4.0538 3.9794 4.6327 2.5815 8.0943 1.9314 2.5369 3.0032 3.9500 2.7582 2.6976 1.4962 4.3662 1.9186 3.8728 3.9195 2.1919 2.7782 3.4875 2.9141 2.7535 3.9608 3.0017 3.0583 2.1847 2.4824 1.9750 5.4531 2.9515 6.4002 1.8182 4.5496 1.8188 2.4295 1.1505 1.3138 1.2626 4.2710 1.5407 3.3802 2.5012 3.8739 1.3622 1.2194 1.2973 5.8701 1.8890 2.3909 1.9715 2.1836 2.5556 1.8901 1.6301 2.1397 2.0559 4.0542 1.8423 1.9508 1.2426 1.2550 1.6940 1.9434 1.2965 1.3745 1.6173 1.1995 1.1882 1.3833 1.3691 1.8297 1.3416 1.3577 4.5757 1.2304 1.2312 2.2637 1.0934 1.9580 1.0703 1.1109 1.2593 1.0693 1.0617 1.0991 1.3637 1.1076 2.9251 5.6065 6.3018 5.2690 10.4871 1.0575 1.0713 1.0700 1.0993 1.0649 1.0361 1.0363 1.0911 1.0919 1.0932 1.0983 1.0996 1.0989 1.1005 1.0856 1.0862 1.0925 1.0947 1.0786 1.1002 1.0765
irintensity: 0.0830 0.1097 0.7925 0.2144 3.8054 2.3733 0.6869 0.7767 2.5668 7.7066 0.6330 0.9775 6.4831 1.7287 0.0250 0.9878 2.0400 10.1117 4.7250 6.0939 0.9505 0.0344 6.9202 21.9996 10.4949 20.1036 41.8389 30.1345 28.2459 4.1195 12.3280 0.0968 45.1418 2.1304 83.9974 23.9915 4.1177 2.5145 0.5812 0.1328 11.3273 14.0284 2.2778 34.8761 0.3984 46.3094 1.0782 5.2193 14.5702 11.8489 0.3016 6.2799 27.8317 24.8415 8.4047 7.6138 19.6704 16.5011 19.7709 36.7091 16.3396 58.4946 35.6692 27.0892 15.5977 20.6514 2.8461 4.6542 20.9728 6.5600 1.6529 35.5823 20.1527 65.7218 47.5655 15.8001 21.0408 223.8885 5.7415 945.3129 20.5844 21.6971 102.8470 16.9914 27.1151 11.9304 29.1964 98.9737 126.0188 21.3503 216.8282 23.9369 308.1185 147.0652 27.8387 140.6533 35.0672 40.9482 21.1608 17.6879 10.6490 3.2948 12.4009 33.9254 55.4550 63.1882 35.1973 13.7333 4.6284 23.1944 56.9574 384.1234 21.6507 134.6659
temp: 298.150 k
press: 1.00000 atm
elementType: 8 8 7 7 7 6 6 6 6 6 6 6 6 6 6 6 6 6 6 1 1 1 1 1 1 1 1 1 1 1 1 1 1 1 1 1 1 1 1 1
symmnumber: 1
zpe: 874711.5 jmol-1
zpe.correction: 0.333160 hartree
zpe.thermalcorrener: 0.353491 hartree
zpe.thermalcorrenthalpy: 0.354435 hartree
zpe.thermalcorrgfe: 0.280854 hartree
zpe.sumelectzpe: -859.344056 hartree
zpe.sumelectthermal: -859.323725 hartree
zpe.sumelectthermalent: -859.322781 hartree
zpe.sumelectthermalfe: -859.396362 hartree
dipole: 4.5198 -6.2781 0.1396
dipole: 7.7371
quadrupole: -104.5943 -129.0509 -114.5210
quadrupole: -16.1014 1.1457 0.5428
quadrupole: 11.4611 -12.9955 1.5344 -16.1014 1.1457 0.5428
hfenergy: -859.6772162 hartree
pointgroup: C01 [X(C14H21N3O2)]
dipole: -2.2972545 -0.6154433 1.899968 debye
polarizability: 239.071185|12.6808299|120.8530728|25.1231677|-14.45885|192.8385582 unknown
InChI: InChI=1S/C14H21N3O2/c1-3-17(4-2)11-14(19)16-13(18)10-15-12-8-6-5-7-9-12/h5-9,15-16H,3-4,10-11H2,1-2H3
charge 0 multiplicity 1
40 atoms
O  -2.329575 0.334115 -3.980868
O  0.517536 0.454814 -2.982411
N  -3.817181 -0.384887 -0.687314
N  -1.450778 -0.116352 -1.811522
N  2.08718 0.135988 -0.812925
C  -3.836366 -0.394883 -2.174856
C  -4.670843 -1.449523 -0.074897
C  -4.10902 0.986573 -0.153664
C  -2.465868 -0.000547 -2.782712
C  -4.068741 -2.858994 -0.217168
C  -3.599758 1.203996 1.281949
C  0.684051 -0.132908 -0.606556
C  -0.072473 0.100384 -1.931551
C  3.058012 0.031066 0.181849
C  2.73237 -0.367772 1.513146
C  4.420721 0.329827 -0.124949
C  3.742126 -0.46062 2.495658
C  5.414597 0.231734 0.866172
C  5.088619 -0.16389 2.187655
H  -4.602332 0.277994 -2.613752
H  -4.059591 -1.414737 -2.538795
H  -4.772254 -1.214764 0.998976
H  -5.699829 -1.426499 -0.505726
H  -3.606983 1.710242 -0.823204
H  -5.201632 1.204272 -0.210966
H  -4.725644 -3.602372 0.269905
H  -3.074957 -2.907544 0.261773
H  -3.954731 -3.163188 -1.273428
H  -3.790778 2.246273 1.595138
H  -2.511594 1.021104 1.343604
H  -4.099044 0.54281 2.011913
H  -1.882787 -0.384106 -0.896697
H  0.238324 0.525836 0.175645
H  0.497458 -1.18079 -0.274209
H  2.340193 0.417526 -1.764507
H  1.697592 -0.605759 1.782142
H  4.687355 0.63798 -1.143644
H  3.469921 -0.768692 3.512302
H  6.453542 0.466186 0.606068
H  5.866166 -0.237596 2.954826
