program: Gaussian 09
title: 000206510
version: EM64L-G09RevD.01
frameworkgroup: C1[X(C19H21NO3)]
method: RPBEPBE
basis: SDD
operation: Freq
keyword: #p
keyword: freq=noraman
keyword: PBEPBE/SDD
title: #p freq=noraman PBEPBE/SDD
converged: YES YES NO NO
title: Mulliken charges:
elementType: O O O N C C C C C C C C C C C C C C C C C C C H H H H H H H H H H H H H H H H H H H H H
charge: -0.241944 -0.266903 -0.259094 -0.274794 -0.012945 -0.484336 -0.469304 -0.425850 -0.436917 -0.546141 0.161045 0.109870 -0.470642 -0.516636 -0.451121 0.156601 0.178142 0.227405 -0.551014 -0.437494 0.190489 0.204126 -0.208282 0.237623 0.188691 0.220603 0.256804 0.179756 0.203791 0.218933 0.220404 0.203852 0.241206 0.236112 0.228292 0.227761 0.228060 0.231526 0.229879 0.220325 0.260907 0.323692 0.239517 0.228004
chargesum: 0.00000
title: Mulliken charges with hydrogens summed into heavy atoms:
elementType: O O O N C C C C C C C C C C C C C C C C C C C
charge: -0.241944 -0.266903 -0.259094 -0.274794 0.224679 -0.075043 -0.032743 -0.003126 -0.012662 -0.068823 0.161045 0.109870 -0.014590 -0.057049 -0.000917 0.156601 0.178142 0.227405 -0.290107 -0.113802 0.190489 0.204126 0.259239
polarizability: 3.11150469e+02 2.26396483e+01 2.44036255e+02 -6.31237122e+00 3.87927497e+00 1.28969562e+02
1716.lowfreq: -0.0005 -0.0003 0.0005 1.7522 3.9637 6.5652 24.8608 34.8879 44.9053
frequency: 24.7467 34.6892 44.7734 62.0839 68.0913 84.6067 99.7323 111.4023 133.7513 143.9851 146.0796 162.5868 214.4428 221.2124 229.6668 242.1088 314.3708 336.6016 348.0865 372.3342 376.9908 420.8479 424.5918 428.1966 538.8219 545.9966 560.1343 617.4941 622.3738 625.4637 653.5386 669.5832 676.5509 685.8273 722.2216 745.1532 763.4349 771.0997 780.7255 807.3373 823.6430 842.7663 854.9634 860.3444 880.2666 884.1525 894.7251 900.7739 902.6490 907.3336 948.7141 962.1346 973.1962 975.3724 983.5395 1011.5471 1020.8876 1042.1210 1058.3102 1074.1185 1079.6450 1089.3049 1112.0806 1128.5016 1133.5977 1135.2069 1152.9012 1176.3981 1186.9581 1192.7069 1195.4420 1208.1321 1214.9313 1229.7099 1241.2040 1250.5315 1262.9192 1274.1862 1282.0503 1288.0745 1294.1860 1300.2290 1305.4158 1311.3732 1331.0506 1354.3335 1361.4003 1365.1137 1385.7886 1401.7440 1429.6981 1459.0750 1463.4229 1464.8579 1471.0100 1473.8798 1474.8693 1481.2118 1482.6860 1492.1199 1501.8840 1581.6221 1597.8323 1617.7813 1625.7094 2959.7579 2966.3172 2967.5043 2971.4828 2974.1048 2987.6628 2995.1841 2999.6579 3010.7192 3011.6896 3030.9795 3031.8310 3038.4925 3040.0966 3050.8898 3070.1143 3081.5605 3082.9793 3110.8143 3179.0884 3225.1943
redmass: 5.3832 1.7532 3.1431 2.9400 3.5605 3.9849 5.1233 2.7228 3.0098 2.4419 2.5572 4.1512 3.0327 4.2589 4.9491 4.6674 3.7269 6.9569 7.7840 6.1970 5.1587 4.2242 4.2594 2.0743 4.1973 3.2189 3.7547 3.0377 3.3017 4.1377 5.6844 7.1168 6.7259 3.4441 3.1125 4.3686 1.7018 3.9641 5.7198 1.5781 2.1231 6.0288 2.6764 1.5941 3.4281 2.3400 2.9041 1.4920 1.6790 1.9062 3.6398 1.5231 1.6617 4.8722 1.5726 3.3666 3.1217 1.7019 2.9678 1.6490 3.4190 2.3490 2.5096 1.5840 1.1646 1.1856 1.5968 1.4855 1.3117 1.3055 1.3348 1.4672 1.3059 2.0517 1.3456 1.5504 1.5204 1.4991 1.4501 1.7945 1.2516 1.3323 1.4425 1.4667 1.9157 2.5420 1.3576 2.2245 4.2229 6.6571 1.0972 1.9926 1.4820 1.0801 1.0914 1.0858 1.0829 1.1505 1.2862 1.1007 6.0112 8.0502 9.6757 8.7934 8.6658 1.0667 1.0625 1.0666 1.0650 1.0634 1.0631 1.0614 1.0804 1.0678 1.0656 1.0964 1.0951 1.0979 1.0907 1.1027 1.1001 1.1047 1.1010 1.1075 1.0936 1.0940
irintensity: 0.6225 0.0067 0.2336 0.1556 3.9954 2.5462 1.5346 11.1868 0.1095 0.4855 1.9692 0.0625 2.9977 9.2355 2.8834 0.3206 1.9994 4.3464 1.7436 1.7492 1.0824 4.5219 6.4789 2.7367 13.8223 6.1000 6.0615 3.7773 0.7898 0.5109 1.2476 1.8327 2.3407 14.9343 2.1962 0.2741 6.8801 10.9824 24.8233 1.8230 4.3417 31.2989 5.4869 24.4039 3.0597 9.6488 0.8602 23.2463 13.6984 1.7646 7.1868 10.2513 4.2863 151.2023 8.0737 23.0526 58.7919 1.0900 0.8314 6.8039 90.4512 2.2411 34.4984 19.7106 3.1035 8.8102 9.7315 5.3818 29.9491 2.3548 24.7070 53.5007 3.4267 118.0811 0.5622 15.8108 41.4113 48.8321 17.9710 67.2982 14.7629 6.9999 4.4458 4.3806 26.4686 106.3682 7.7630 125.3671 268.5825 34.6655 24.3395 78.9887 65.4583 0.8330 1.6873 7.8445 11.5125 4.4919 4.4411 3.3930 52.5966 70.7541 98.7875 20.3396 20.2443 67.2623 8.1978 18.1462 58.0445 44.9286 157.9814 31.6490 23.2936 30.6620 63.6945 7.7980 29.9832 35.3242 52.9085 9.8993 38.6491 39.3619 76.6081 33.9368 2.2715 9.9532
temp: 298.150 k
press: 1.00000 atm
elementType: 8 8 8 7 6 6 6 6 6 6 6 6 6 6 6 6 6 6 6 6 6 6 6 1 1 1 1 1 1 1 1 1 1 1 1 1 1 1 1 1 1 1 1 1
symmnumber: 1
zpe: 946737.7 jmol-1
zpe.correction: 0.360593 hartree
zpe.thermalcorrener: 0.380738 hartree
zpe.thermalcorrenthalpy: 0.381682 hartree
zpe.thermalcorrgfe: 0.310094 hartree
zpe.sumelectzpe: -1015.350529 hartree
zpe.sumelectthermal: -1015.330384 hartree
zpe.sumelectthermalent: -1015.329440 hartree
zpe.sumelectthermalfe: -1015.401028 hartree
dipole: 1.1518 3.5665 -0.2096
dipole: 3.7537
quadrupole: -124.7084 -129.2833 -135.5839
quadrupole: 7.1877 2.2261 0.9620
quadrupole: 5.1501 0.5752 -5.7254 7.1877 2.2261 0.9620
hfenergy: -1015.7111226 hartree
pointgroup: C01 [X(C19H21N1O3)]
dipole: 0.4415706 -1.4080185 0.059217 debye
polarizability: 310.7822849|-23.2868964|244.2617368|5.7867186|5.7192795|129.112264 unknown
InChI: InChI=1S/C19H21NO3/c21-19(8-12-4-1-2-5-12)20-15-7-3-6-13(15)14-9-17-18(10-16(14)20)23-11-22-17/h9-10,12H,1-8,11H2
charge 0 multiplicity 1
44 atoms
O  1.198336 1.707773 0.445677
O  -5.264482 0.999647 -0.21468
O  -3.769652 2.843479 0.096724
N  0.159225 -0.353775 0.134894
C  3.857725 0.715298 0.371037
C  5.213425 0.004968 0.623954
C  4.109153 1.452088 -0.970459
C  6.289957 1.033262 0.165621
C  5.563462 1.99029 -0.845536
C  2.663855 -0.255446 0.36316
C  0.076294 -1.775155 -0.000463
C  -1.240671 -2.158112 -0.147574
C  1.049438 -2.9265 -0.120445
C  -1.36875 -3.644693 -0.37806
C  0.074491 -4.157631 -0.021111
C  1.310652 0.45724 0.315673
C  -2.077037 -0.976597 -0.107325
C  -1.189901 0.146115 0.077963
C  -3.485003 -0.787162 -0.206755
C  -1.654548 1.482686 0.176839
C  -3.926692 0.530355 -0.104841
C  -3.040597 1.62235 0.081032
C  -5.193849 2.433411 0.165999
H  3.688504 1.477062 1.157569
H  5.268517 -0.910501 -0.000294
H  5.343515 -0.306234 1.677169
H  3.369165 2.248068 -1.156588
H  4.039716 0.722709 -1.804197
H  7.16047 0.530117 -0.292203
H  6.669238 1.606021 1.031619
H  5.553176 3.02376 -0.453273
H  6.072667 2.023904 -1.825332
H  2.685545 -0.886337 1.276034
H  2.754179 -0.949906 -0.494335
H  1.579544 -2.912413 -1.095352
H  1.822779 -2.965067 0.666951
H  -2.138953 -4.128248 0.250882
H  -1.629169 -3.865764 -1.432836
H  0.076416 -4.528044 1.0199
H  0.397071 -4.988593 -0.67197
H  -4.176234 -1.619839 -0.354797
H  -0.979576 2.325748 0.312058
H  -5.773311 3.025641 -0.557955
H  -5.552992 2.548029 1.207525
