program: Gaussian 09
title: 000206508
version: EM64L-G09RevD.01
frameworkgroup: C1[X(C20H17NO3)]
method: RPBEPBE
basis: SDD
operation: Freq
keyword: #p
keyword: freq=noraman
keyword: PBEPBE/SDD
title: #p freq=noraman PBEPBE/SDD
converged: YES YES NO NO
title: Mulliken charges:
elementType: O O O N C C C C C C C C C C C C C C C C C C C C H H H H H H H H H H H H H H H H H
charge: -0.269851 -0.261859 -0.224120 -0.270563 0.086386 0.154936 -0.521577 -0.470944 -0.442933 0.193338 0.264748 -0.548409 -0.437137 -0.008063 0.189493 0.200793 0.313296 -0.204072 -0.366456 -0.366200 -0.383529 -0.385129 0.441738 -0.804905 0.230868 0.230871 0.248496 0.248588 0.225973 0.225962 0.261559 0.323063 0.234443 0.234443 0.247639 0.247678 0.234336 0.234385 0.225813 0.241151 0.225750
chargesum: 0.00000
title: Mulliken charges with hydrogens summed into heavy atoms:
elementType: O O O N C C C C C C C C C C C C C C C C C C C C
charge: -0.269851 -0.261859 -0.224120 -0.270563 0.086386 0.154936 -0.059838 0.026140 0.009002 0.193338 0.264748 -0.286850 -0.114074 -0.008063 0.189493 0.200793 0.313296 0.264814 -0.118817 -0.118522 -0.149193 -0.150743 0.441738 -0.112190
polarizability: 3.72394567e+02 -1.49614373e+01 2.10221861e+02 6.26581503e-02 3.77512366e-02 1.45671765e+02
1716.lowfreq: -95.1003 -83.6690 -41.7089 -21.8491 -5.4884 -0.0007 -0.0002 0.0008 1.9118
frequency: -95.0825 -83.6610 -41.6474 -21.6857 23.0706 42.7831 74.1689 85.8575 127.9074 132.3724 153.8328 164.3089 207.9072 214.8269 238.7146 279.8208 329.3480 338.9622 343.6853 356.4176 386.1133 393.5555 395.7085 421.6966 439.3974 512.4672 557.5572 603.7356 612.3859 625.8025 628.6571 657.0956 667.3350 681.6019 721.2411 726.1875 740.4789 741.1020 757.5423 760.2442 777.7738 789.7557 832.3642 842.6548 853.2868 853.7292 857.9658 885.6088 895.8900 915.7585 949.9496 959.2374 975.0088 976.6480 983.4135 987.2286 1011.0232 1016.8655 1038.1220 1047.6899 1065.0161 1073.5475 1108.9317 1119.5675 1124.1046 1146.2860 1181.2110 1191.6142 1196.4506 1208.8926 1222.8840 1225.9009 1234.6753 1245.5782 1273.5446 1293.3896 1308.1291 1315.5045 1357.4889 1360.3931 1366.2851 1387.7222 1397.8526 1400.4767 1403.9037 1459.9239 1463.9176 1469.7348 1473.1866 1475.9309 1485.1851 1488.4234 1499.9726 1503.1734 1573.7165 1575.0755 1594.9978 1618.2062 1621.3567 1628.0350 2977.2446 2978.1509 2992.7229 3006.8416 3018.2735 3023.1601 3033.7244 3058.8770 3082.1661 3082.6633 3087.1511 3121.9484 3123.1810 3144.7375 3149.8232 3180.6434 3223.1082
redmass: 1.5831 2.3179 4.0331 1.0752 4.5548 4.4473 4.7485 6.4868 3.6596 6.0470 4.3961 4.5067 4.8420 6.2981 4.9068 6.0257 8.0140 2.7452 7.7804 6.7619 4.9202 4.6253 2.9562 3.2388 6.8765 3.6391 4.7746 4.6470 5.0215 5.5968 6.4659 6.7622 8.3576 9.6677 7.7537 3.5396 5.3758 2.8420 1.3722 4.3431 5.4068 6.0450 2.0667 4.4628 1.2491 6.9041 1.4453 3.4736 1.3514 1.4365 2.3220 1.8373 1.3856 6.5512 4.2645 1.4036 3.5709 2.8956 1.7261 1.5708 1.4594 4.8078 3.0219 1.0362 1.3321 1.1590 3.5471 1.1825 1.1173 1.5489 2.7950 1.7847 1.0715 1.5611 2.0414 1.7479 1.2882 4.6238 5.1667 2.4636 1.8124 4.4110 1.2236 3.1448 6.7075 2.0411 1.6041 1.0918 1.0543 1.0868 1.2666 1.1596 4.1930 2.7554 11.3902 5.9846 9.2642 8.2777 6.5009 8.3520 1.0386 1.0590 1.0591 1.0533 1.1032 1.0615 1.1026 1.0951 1.1188 1.1050 1.0999 1.0877 1.0878 1.0962 1.0976 1.0937 1.0941
irintensity: 0.5484 14.1833 0.1243 0.9574 0.2976 0.4033 1.5054 0.0721 0.1060 0.7073 0.8146 0.3359 1.1469 3.3991 0.1304 10.4480 3.9397 0.9663 1.7028 1.2345 0.4406 3.3192 0.0329 6.4225 9.8930 10.3635 1.0939 20.4710 1.5384 21.0055 0.0086 4.2584 0.0486 1.6564 1.1508 1.7868 11.7452 0.7263 8.4474 23.7681 21.0209 12.4842 69.8612 10.4309 0.1251 26.0958 23.2242 2.2627 36.8048 1.3910 8.6501 0.2661 0.0415 71.4829 181.7171 0.4050 7.7999 1.0541 0.0400 24.5614 4.2998 34.7598 107.0967 0.0021 9.3470 0.0133 23.9981 0.7750 13.6813 24.1986 17.9929 72.4393 0.3943 16.7399 112.9355 10.2606 0.5575 246.5033 0.1860 180.6731 64.4373 308.1834 12.5745 2.7000 41.6544 88.4250 60.1118 15.1070 12.6683 4.9500 2.2035 11.5548 61.9318 22.0059 212.3904 0.1883 1.6223 2.9449 17.5450 15.6126 40.0650 43.2338 49.4130 171.8184 15.0897 71.6986 2.6497 19.8142 31.7529 42.6404 18.0104 4.8447 21.1578 24.6487 0.9719 2.1928 9.8884
temp: 298.150 k
press: 1.00000 atm
elementType: 8 8 8 7 6 6 6 6 6 6 6 6 6 6 6 6 6 6 6 6 6 6 6 6 1 1 1 1 1 1 1 1 1 1 1 1 1 1 1 1 1
symmnumber: 1
zpe: 837496.4 jmol-1
zpe.correction: 0.318986 hartree
zpe.thermalcorrener: 0.336194 hartree
zpe.thermalcorrenthalpy: 0.337139 hartree
zpe.thermalcorrgfe: 0.273157 hartree
zpe.sumelectzpe: -1051.056346 hartree
zpe.sumelectthermal: -1051.039137 hartree
zpe.sumelectthermalent: -1051.038193 hartree
zpe.sumelectthermalfe: -1051.102174 hartree
dipole: -2.7669 3.5025 -0.0003
dipole: 4.4635
quadrupole: -110.5391 -144.5398 -133.2828
quadrupole: -5.2237 0.0140 0.0001
quadrupole: 18.9148 -15.0859 -3.8289 -5.2237 0.0140 0.0001
hfenergy: -1051.3753315 hartree
pointgroup: C01 [X(C20H17N1O3)]
dipole: 1.0455617 -1.4109077 0.0004703 debye
polarizability: 371.3181662|-19.9305635|211.2981584|0.1807638|-0.0307597|145.6718682 unknown
InChI: InChI=1S/C20H17NO3/c1-12-5-7-13(8-6-12)20(22)21-16-4-2-3-14(16)15-9-18-19(10-17(15)21)24-11-23-18/h5-10H,2-4,11H2,1H3
charge 0 multiplicity 1
41 atoms
O  -5.575777 0.001929 0.000074
O  -4.608295 2.20176 0.001008
O  0.513272 2.431927 0.004706
N  0.019969 0.150629 0.003657
C  -0.857848 -1.973889 0.00275
C  0.313328 -1.250117 0.003676
C  -0.607585 -3.459833 0.002453
C  1.563584 -2.091395 0.00409
C  0.969998 -3.555666 0.003648
C  -1.978096 -1.051708 0.002156
C  -1.415641 0.275841 0.002708
C  -3.388014 -1.245149 0.001235
C  -2.210338 1.44942 0.002382
C  0.923399 1.235847 0.00453
C  -4.158447 -0.082528 0.000945
C  -3.587732 1.214203 0.001505
C  2.398049 0.913672 0.007163
C  -5.891473 1.454325 0.000112
C  3.110544 0.816739 -1.21226
C  3.105445 0.813763 1.229255
C  4.506451 0.607842 -1.205354
C  4.501447 0.604917 1.227642
C  5.227087 0.499749 0.012541
C  6.733883 0.311445 0.015217
H  -1.043966 -3.95813 0.889653
H  -1.042595 -3.957508 -0.88577
H  2.202161 -1.907784 -0.879747
H  2.201495 -1.908056 0.888451
H  1.321966 -4.108957 0.891369
H  1.323353 -4.10903 -0.883477
H  -3.840884 -2.238952 0.000799
H  -1.777651 2.448407 0.002747
H  -6.450356 1.700199 -0.919875
H  -6.451473 1.699907 0.919497
H  2.576269 0.909232 -2.164578
H  2.567245 0.903881 2.179587
H  5.044357 0.533338 -2.158182
H  5.035388 0.528104 2.182501
H  7.075043 -0.246543 -0.874387
H  7.253397 1.289336 0.008322
H  7.073539 -0.233368 0.913453
