program: Gaussian 09
title: 000206451
version: EM64L-G09RevD.01
frameworkgroup: C1[X(C22H26N4)]
method: RPBEPBE
basis: SDD
operation: Freq
keyword: #pfreq=noraman
keyword: PBEPBE/SDD
title: #p freq=noraman PBEPBE/SDD
converged: YES YES NO NO
title: Mulliken charges:
elementType: N N N N C C C C C C C C C C C C C C C C C C C C C C H H H H H H H H H H H H H H H H H H H H H H H H H H
charge: -0.093535 -0.079283 -0.482803 -0.006277 -0.135564 -0.148351 -0.539729 -0.437256 -0.401978 0.166815 0.155709 -0.348970 0.147310 -0.707535 -0.337490 0.203052 -0.572275 -0.424394 -0.372613 -0.257369 0.508647 -0.223926 -0.354962 -0.353513 -0.332931 -0.334416 0.228825 0.205282 0.250910 0.211978 0.204367 0.207299 0.211635 0.197675 0.185554 0.198275 0.225295 0.198632 0.237364 0.193913 0.223956 0.296017 0.218553 0.227386 0.232002 0.227386 0.217708 0.218772 0.236222 0.233665 0.237622 0.237343
chargesum: 0.00000
title: Mulliken charges with hydrogens summed into heavy atoms:
elementType: N N N N C C C C C C C C C C C C C C C C C C C C C C
charge: -0.093535 -0.079283 -0.186786 -0.006277 0.093261 0.056931 -0.076841 -0.025589 0.007332 0.166815 0.155709 0.034859 0.147310 -0.046244 0.080380 0.203052 -0.126336 -0.192392 -0.145228 -0.039661 0.508647 -0.005154 -0.118740 -0.119848 -0.095309 -0.097073
polarizability: 3.43291028e+02 -2.14617258e+01 2.75264999e+02 2.12071132e+01 2.12570027e+01 1.68232579e+02
1716.lowfreq: -4.6390 -0.0007 -0.0006 -0.0005 1.2087 3.7401 13.6003 20.1091 27.4049
frequency: 13.2778 19.9989 27.1985 46.8404 56.8709 75.6210 94.4576 114.8704 137.5931 168.3956 177.8722 186.7025 194.8952 207.3505 228.3612 264.7675 297.6052 307.4318 320.7585 333.6939 338.3306 360.7264 370.3416 396.4076 417.3353 448.0017 469.0087 480.7108 493.5438 505.0683 525.1295 548.7521 574.4730 581.1645 593.7365 602.0098 650.9153 663.8377 668.1154 698.3518 717.6060 747.6990 750.3754 758.0466 775.7917 782.6152 790.7821 808.1663 827.6033 848.4917 849.0144 868.0852 886.2739 887.4001 903.2775 927.6766 945.2726 960.6601 963.1378 967.5052 975.1322 975.7349 1010.6163 1011.6717 1016.0770 1026.9243 1035.5575 1057.2065 1062.6656 1068.0649 1074.7718 1084.9783 1096.3464 1109.5909 1121.0796 1127.8296 1141.3721 1149.9093 1154.0998 1169.0992 1178.2930 1200.1202 1215.1167 1217.4148 1220.4607 1228.2030 1233.9379 1253.9790 1259.4901 1272.7278 1283.4864 1291.1919 1298.7174 1305.4226 1311.1593 1321.4974 1328.3674 1336.1852 1339.2924 1352.0458 1353.0267 1365.0693 1373.9329 1380.8827 1389.2780 1404.7539 1408.5809 1435.7314 1452.0064 1459.2148 1461.1821 1463.1187 1466.3925 1467.4526 1471.8023 1475.7362 1479.9467 1482.6789 1484.5985 1556.9591 1577.3379 1588.8699 1591.2850 1631.4269 2844.7101 2854.7226 2873.9759 2908.5362 2958.6957 2965.8841 2984.0951 2996.4065 3000.6557 3016.9759 3018.0942 3024.6159 3027.8918 3040.7347 3066.9583 3078.2024 3097.5798 3120.2952 3121.9118 3123.2915 3127.7032 3141.9401 3143.2902 3150.2728 3160.2126 3605.8800
redmass: 4.5420 4.4755 4.1623 4.3292 3.8988 4.0976 3.1016 3.7350 4.3970 3.3614 1.2594 3.1326 2.5140 3.2698 3.2395 2.3715 3.4956 4.4830 2.6519 3.2058 3.2865 2.5823 2.4921 2.5969 3.2477 3.4702 4.1787 1.1986 3.2870 3.7653 3.4758 3.5682 3.8445 3.7288 4.6836 5.2323 3.8858 6.9165 3.6621 3.2941 3.4033 1.3528 3.4243 3.8642 2.4856 3.0728 1.3530 1.7986 3.8627 1.8451 1.8609 2.7241 1.8580 1.2496 3.1813 1.3866 2.0459 5.5908 1.4762 1.3014 2.3725 1.5359 2.0918 2.2926 1.7612 2.8324 2.1473 2.4448 2.1906 1.9162 2.2165 1.8989 1.6907 1.8410 2.5108 2.7873 2.0614 2.1614 2.0110 1.3226 1.3509 1.4875 1.4556 1.4101 1.6002 2.0280 1.6446 1.4015 1.4219 1.7619 1.2910 1.4207 1.4074 1.6055 5.4285 1.6715 1.4518 1.2850 1.2851 1.9449 1.5120 1.3782 1.4470 1.2885 1.3849 2.0290 3.9692 2.8332 1.0818 1.0608 1.1008 1.3098 2.0002 2.2681 1.1194 1.3081 1.9238 1.2489 1.0979 6.7525 6.8884 5.7321 6.4609 6.9983 1.0708 1.0703 1.0693 1.0681 1.0834 1.0595 1.0361 1.0876 1.0610 1.0931 1.0896 1.0921 1.0891 1.0881 1.1029 1.0984 1.1010 1.0847 1.0868 1.0880 1.0890 1.0950 1.0961 1.0994 1.1001 1.0802
irintensity: 0.0868 0.0663 0.7335 0.7083 0.3174 0.0873 1.7005 0.8130 1.1698 0.1525 0.0802 1.8410 0.6425 2.3842 0.1152 1.6617 2.8362 1.3793 0.7640 0.8661 0.7029 5.8884 0.1011 3.0411 11.1101 3.7276 0.0254 73.2548 9.5884 1.8920 29.4806 5.1047 8.0746 18.5358 0.9834 2.6344 6.5034 0.4946 3.1792 4.4761 3.1741 97.3155 0.8522 2.3318 6.3262 6.1532 0.5199 28.7652 2.0029 10.5303 10.7525 0.3585 4.4236 0.2198 0.2564 2.9018 7.9143 2.9474 0.0999 0.0370 2.0734 0.2174 7.8561 21.6384 6.6600 23.0083 20.3356 10.1614 5.6029 2.9123 3.2598 8.8816 2.2212 10.5940 25.7032 28.7854 78.9228 13.0914 38.6945 7.1657 9.8260 5.8021 4.2477 2.2464 5.3717 0.6783 15.3961 6.2484 24.4355 0.8076 2.5755 9.1824 10.5639 24.2925 4.8188 22.4334 35.3325 0.6793 20.6582 25.7465 8.5624 24.3706 14.7032 15.1177 0.4160 15.8903 15.3466 8.1829 3.3155 10.7629 15.4935 1.5983 6.2770 22.5641 6.0762 8.8509 9.3332 6.2522 9.3665 13.2069 0.3638 75.8473 3.0455 0.6291 45.6591 81.1229 136.7681 71.3884 33.8190 21.0659 26.8661 15.9947 16.8136 35.7907 7.9015 57.5038 40.2388 39.2122 24.6060 37.3912 36.1068 2.2809 8.0331 12.9991 4.4032 37.7250 56.7493 0.6756 37.1100 42.9054
temp: 298.150 k
press: 1.00000 atm
elementType: 7 7 7 7 6 6 6 6 6 6 6 6 6 6 6 6 6 6 6 6 6 6 6 6 6 6 1 1 1 1 1 1 1 1 1 1 1 1 1 1 1 1 1 1 1 1 1 1 1 1 1 1
symmnumber: 1
zpe: 1149710.8 jmol-1
zpe.correction: 0.437902 hartree
zpe.thermalcorrener: 0.460257 hartree
zpe.thermalcorrenthalpy: 0.461201 hartree
zpe.thermalcorrgfe: 0.384099 hartree
zpe.sumelectzpe: -1071.042015 hartree
zpe.sumelectthermal: -1071.019660 hartree
zpe.sumelectthermalent: -1071.018716 hartree
zpe.sumelectthermalfe: -1071.095818 hartree
dipole: -3.1108 -2.9009 -1.0719
dipole: 4.3865
quadrupole: -184.2983 -146.7265 -153.3693
quadrupole: 2.5738 2.5136 7.9548
quadrupole: -22.8336 14.7382 8.0953 2.5738 2.5136 7.9548
hfenergy: -1071.4799171 hartree
pointgroup: C01 [X(C22H26N4)]
dipole: 1.1922007 1.1808177 -0.4032282 debye
polarizability: 344.0311756|-19.3901978|275.1605659|-22.2968885|-19.2406775|167.5968638 unknown
InChI: InChI=1S/C22H26N4/c1-16-22-20(19-4-2-3-5-21(19)24-22)14-18-15-25(12-13-26(16)18)11-8-17-6-9-23-10-7-17/h2-7,9-10,16,18,24H,8,11-15H2,1H3
charge 0 multiplicity 1
52 atoms
N  0.951863 2.123053 0.112468
N  -1.538431 0.648632 0.174825
N  4.502607 0.96405 -0.608742
N  -7.824418 -1.292609 0.251965
C  0.698362 1.105321 1.183585
C  2.405877 2.412601 -0.094577
C  1.328123 -0.294235 0.882088
C  -0.821669 1.014333 1.424265
C  0.236937 1.778165 -1.144745
C  2.713781 -0.121361 0.312285
C  3.184866 1.111834 -0.137353
C  -1.272791 1.664544 -0.874601
C  3.775581 -1.087577 0.102859
C  2.940052 3.389347 0.984044
C  -2.978913 0.404533 0.40746
C  4.89058 -0.377003 -0.475541
C  -3.648589 -0.381737 -0.754557
C  3.902767 -2.480484 0.346699
C  6.10203 -1.018114 -0.810882
C  5.111053 -3.12586 0.015085
C  -5.095339 -0.709864 -0.435395
C  6.198931 -2.403123 -0.557675
C  -5.459345 -1.931814 0.186119
C  -6.140817 0.211998 -0.700185
C  -6.813667 -2.178005 0.505262
C  -7.468705 -0.115439 -0.345817
H  1.15942 1.498389 2.11064
H  2.483159 2.927133 -1.075867
H  0.669224 -0.851135 0.18668
H  1.359524 -0.879461 1.823362
H  -1.024581 0.237865 2.185719
H  -1.175076 1.997029 1.825325
H  0.599086 0.827171 -1.600657
H  0.409918 2.590709 -1.875582
H  -1.662816 2.669104 -0.567848
H  -1.78159 1.368743 -1.809542
H  2.876291 2.9422 1.991447
H  4.000681 3.642904 0.799081
H  2.343937 4.317839 0.971619
H  -3.545168 1.356427 0.578982
H  -3.076143 -0.194737 1.332811
H  5.078793 1.70855 -0.994895
H  -3.599072 0.214924 -1.684282
H  -3.061517 -1.303135 -0.9200
H  3.072706 -3.046829 0.784391
H  6.941724 -0.468492 -1.251729
H  5.22169 -4.200718 0.197754
H  7.125769 -2.93281 -0.805369
H  -4.69889 -2.688041 0.412843
H  -5.92705 1.171553 -1.18535
H  -7.11499 -3.118986 0.980165
H  -8.290153 0.582716 -0.544932
