program: Gaussian 09
title: 000015477
version: EM64L-G09RevD.01
frameworkgroup: C1[X(C4H5N3O2)]
method: RPBEPBE
basis: SDD
operation: Freq
keyword: #pfreq=noraman
keyword: PBEPBE/SDD
title: #p freq=noraman PBEPBE/SDD
converged: YES YES NO NO
title: Mulliken charges:
elementType: O O N N N C C C C H H H H H
charge: -0.165643 -0.230918 -0.126141 -0.028398 0.075323 0.199155 -0.159488 -0.587012 -0.271330 0.270523 0.270641 0.215647 0.270532 0.267109
chargesum: 0.00000
title: Mulliken charges with hydrogens summed into heavy atoms:
elementType: O O N N N C C C C
charge: -0.165643 -0.230918 -0.126141 -0.028398 0.075323 0.199155 0.111035 0.169808 -0.004222
polarizability: 1.02202806e+02 1.39354284e+00 8.37724660e+01 -8.94692452e-03 4.29060736e-02 3.32703860e+01
1716.lowfreq: -11.1589 -9.4554 -4.9240 0.0006 0.0008 0.0010 43.7161 162.2536 176.4403
frequency: 43.6698 162.2535 176.4401 233.9514 241.7856 345.4228 425.4405 524.7841 608.2490 629.7736 672.0439 700.8744 759.4798 765.5544 859.9569 883.2786 1035.6092 1076.4503 1119.7002 1121.8680 1147.5747 1236.3105 1284.4846 1331.7091 1349.6568 1363.8829 1405.2330 1439.1032 1455.4907 1478.9915 1483.7013 3022.6721 3128.7814 3129.6613 3230.2241 3255.4077
redmass: 7.0886 1.2204 3.1384 6.6652 3.9573 3.9156 10.0467 5.2579 4.3609 4.7815 6.1225 11.8106 12.1376 1.2614 1.4119 6.5518 2.0718 1.2624 3.5465 1.3275 3.5311 3.8413 2.9479 5.9631 6.4716 11.6031 2.3628 2.3456 1.0405 1.2281 1.6599 1.0330 1.1024 1.1033 1.0924 1.1083
irintensity: 1.8422 0.3225 0.1495 3.1484 1.0222 0.7078 0.1443 0.5137 9.5974 4.2157 10.1814 0.0068 24.3232 66.0502 6.3404 7.1248 23.9302 3.0500 10.6524 0.9741 104.8025 55.8229 51.0334 138.0781 23.3773 206.8260 2.4491 2.1640 16.6820 9.2635 20.3023 18.9007 7.0532 10.3143 1.5237 1.3804
temp: 298.150 k
press: 1.00000 atm
elementType: 8 8 7 7 7 6 6 6 6 1 1 1 1 1
symmnumber: 1
zpe: 257971.5 jmol-1
zpe.correction: 0.098256 hartree
zpe.thermalcorrener: 0.106070 hartree
zpe.thermalcorrenthalpy: 0.107015 hartree
zpe.thermalcorrgfe: 0.065135 hartree
zpe.sumelectzpe: -469.350791 hartree
zpe.sumelectthermal: -469.342977 hartree
zpe.sumelectthermalent: -469.342033 hartree
zpe.sumelectthermalfe: -469.383913 hartree
dipole: -5.8554 3.7214 -0.0042
dipole: 6.9379
quadrupole: -52.9054 -52.3276 -51.4634
quadrupole: -0.3140 -0.0011 -0.0190
quadrupole: -0.6733 -0.0955 0.7687 -0.3140 -0.0011 -0.0190
hfenergy: -469.4490475 hartree
pointgroup: C01 [X(C4H5N3O2)]
dipole: 2.2105911 1.5951884 0.1389987 debye
dipolederiv: -0.7162852 -0.254036 -0.023428 -0.2964634 -0.6187571 -0.0310005 -0.0261221 -0.0301043 -0.1992406 -0.6403154 0.1297695 0.00266 0.250641 -0.7617226 -0.0297945 0.0108886 -0.0318824 -0.2414146 0.2450952 0.2203197 0.0190773 0.2386058 -0.6176561 -0.0336252 0.0196107 -0.0345345 -0.0681456 0.1599041 0.0849216 0.0106641 -0.1956639 -0.4360079 -0.0183661 -0.007469 -0.0142416 -0.2074657 1.8543003 0.0827521 0.0283131 0.0066748 1.1651205 0.0617881 0.0227942 0.063136 0.1929442 -0.834073 0.0783057 -0.0077978 0.1704331 0.404693 0.0230528 -0.0016111 0.0211783 0.1095929 -0.2332972 -0.2053333 -0.0154447 0.3702898 0.189849 0.0264375 0.0234073 0.0185966 -0.1284213 0.1927812 -0.0087299 0.0002805 -0.0036014 0.3907204 0.0134616 0.0007472 0.0137976 0.1866953 -0.1817347 -0.0967556 -0.0067484 -0.4982671 0.06548 0.0074466 -0.033939 0.0129258 -0.1469847 0.0699148 -0.0406484 -0.0046249 -0.079754 0.0497113 -0.0119177 -0.0071314 -0.0112577 0.2089046 0.0654756 0.0459078 0.0822212 -0.0127944 0.0452891 0.0101849 0.0580736 -0.0268204 -0.0073838 -0.0823721 -0.1366616 -0.0136166 -0.0209957 0.0171781 -0.007755 -0.0053826 -0.0097742 0.1234468 0.0702567 0.0549721 -0.0723925 -0.0044394 0.040535 -0.002724 -0.0565822 0.0365679 -0.0096299 0.0303496 0.0452161 0.0008367 0.0753348 0.0655673 -0.0071886 0.0027159 -0.0075872 0.1871024 unknown
polarizability: 102.2905712|-0.3317565|83.4538647|0.9311439|3.3054095|33.5012225 unknown
InChI: InChI=1S/C4H5N3O2/c1-6-3-2-5-4(6)7(8)9/h2-3H,1H3
charge 0 multiplicity 1
14 atoms
O  -2.250935 -1.245477 -0.097992
O  -2.014631 1.028424 0.050293
N  0.785803 0.770871 0.07599
N  0.554235 -1.502762 -0.080326
N  -1.534354 -0.183307 -0.020582
C  -0.092638 -0.319746 -0.009833
C  2.062925 0.219762 0.05661
C  0.497817 2.21811 0.170411
C  1.900948 -1.174846 -0.039573
H  2.95432 0.839704 0.110448
H  -0.105023 2.433041 1.065264
H  1.45812 2.754951 0.226755
H  -0.069669 2.556377 -0.709367
H  2.670181 -1.9417 -0.080398
