program: Gaussian 09
title: 000015476
version: EM64L-G09RevD.01
frameworkgroup: C1[X(C9H12ClN)]
method: RPBEPBE
basis: SDD
operation: Freq
keyword: #p
keyword: freq=noraman
keyword: PBEPBE/SDD
title: #p freq=noraman PBEPBE/SDD
converged: YES YES NO NO
title: Mulliken charges:
elementType: Cl N C C C C C C C C C H H H H H H H H H H H H
charge: -0.071648 -0.163327 -0.387609 0.432982 -0.660510 -0.575904 -0.351983 -0.365332 -0.237705 -0.227931 -0.267089 0.241996 0.247461 0.235338 0.226671 0.236891 0.290169 0.266507 0.227757 0.236199 0.220858 0.219437 0.226773
chargesum: 0.00000
title: Mulliken charges with hydrogens summed into heavy atoms:
elementType: Cl N C C C C C C C C C
charge: -0.071648 -0.163327 0.101848 0.432982 0.038389 -0.019228 -0.124226 -0.129134 -0.016847 -0.008494 -0.040316
polarizability: 1.63237620e+02 -5.22767317e+00 1.17941743e+02 1.05176811e+01 4.60880385e+00 6.23925067e+01
1716.lowfreq: -9.1966 -8.2277 0.0020 0.0031 0.0033 10.1880 36.4669 51.4095 107.5566
frequency: 36.4017 51.3379 107.5531 111.9337 181.6202 205.0371 226.6451 266.6840 321.8838 384.9344 416.8545 487.0869 512.4730 544.1549 614.1956 665.7008 693.6470 741.5244 754.9907 780.8748 812.6760 870.2036 945.3885 956.6579 976.2586 977.0272 1010.4660 1029.8081 1037.0298 1092.4401 1093.9165 1110.3278 1173.1148 1177.5005 1203.3862 1242.2586 1254.7192 1285.4822 1336.6186 1347.4689 1368.9557 1383.1038 1443.0197 1450.9968 1456.2705 1471.4499 1488.1497 1498.2631 1508.7493 1579.1797 1621.5254 2945.9376 3011.1414 3013.8504 3062.3260 3071.1102 3095.6624 3123.4797 3129.9206 3147.9622 3153.0756 3160.5956 3171.4355
redmass: 4.9577 4.9586 2.9384 2.3824 1.7295 2.4089 3.3997 3.3086 4.0946 3.0486 2.9608 3.5578 2.7818 3.8515 6.3913 6.2580 1.8042 4.4555 1.8815 1.1319 1.2535 1.4846 3.0098 1.3707 1.3112 5.2700 1.4834 2.5423 3.3706 1.5048 1.5700 1.2880 1.0565 1.5812 1.1186 2.2809 1.1806 1.3564 1.4297 1.4259 1.8878 6.4715 1.3434 1.8222 1.1346 1.0477 1.1224 1.6819 1.3345 6.0226 6.0420 1.0376 1.1008 1.0604 1.0569 1.1033 1.0958 1.0845 1.0887 1.1118 1.0924 1.0941 1.0995
irintensity: 0.3214 1.0936 1.8254 1.0097 0.2023 9.8232 3.7772 0.0675 9.8440 0.5732 0.0807 10.5041 10.5810 5.3557 0.5615 77.2621 41.7892 9.8296 85.6492 8.5495 0.1570 7.0029 13.6982 0.2177 0.3854 8.2848 3.9304 11.7783 5.7203 21.2872 8.2330 0.8638 0.2548 20.3025 13.0660 34.1148 11.5524 32.8419 9.5083 37.1068 41.8538 7.2905 5.5614 1.4140 11.0106 12.2228 21.4578 45.6192 156.5460 10.7007 179.4527 81.9187 40.9614 25.5487 18.0420 8.7265 24.1730 7.7911 10.4449 16.2458 33.3413 36.8538 5.2224
temp: 298.150 k
press: 1.00000 atm
elementType: 17 7 6 6 6 6 6 6 6 6 6 1 1 1 1 1 1 1 1 1 1 1 1
symmnumber: 1
zpe: 498809.5 jmol-1
zpe.correction: 0.189987 hartree
zpe.thermalcorrener: 0.201049 hartree
zpe.thermalcorrenthalpy: 0.201993 hartree
zpe.thermalcorrgfe: 0.151707 hartree
zpe.sumelectzpe: -864.128873 hartree
zpe.sumelectthermal: -864.117810 hartree
zpe.sumelectthermalent: -864.116866 hartree
zpe.sumelectthermalfe: -864.167152 hartree
dipole: 0.7477 2.3272 0.2793
dipole: 2.4603
quadrupole: -81.5481 -65.3930 -76.3126
quadrupole: -3.8305 1.4026 1.2440
quadrupole: -7.1302 9.0249 -1.8947 -3.8305 1.4026 1.2440
hfenergy: -864.3188591 hartree
pointgroup: C01 [X(C9H12Cl1N1)]
dipole: -0.1811551 -0.9450941 0.1044835 debye
dipolederiv: -0.732083 -0.2324179 -0.0053935 -0.3776289 -0.3321268 -0.0074642 0.0785129 0.0400921 -0.2067609 -1.5961035 0.2680309 0.0328933 0.2427065 -0.7127812 -0.0530176 0.0212137 -0.1046334 -0.3384064 0.6176445 0.1216281 -0.0328028 0.3632551 0.1755236 -0.0246737 0.0911262 0.1478629 0.2136275 1.4692289 -0.5501462 -0.0562647 -0.7655925 0.1524101 0.0796727 -0.1241402 0.0873869 0.1191018 0.0629894 0.0310776 0.024854 -0.0828439 0.6495155 -0.0032336 0.0188685 -0.0591971 0.2457316 0.7524948 0.3052971 -0.0558977 0.3935268 0.365193 -0.0443222 -0.1398429 -0.1377737 0.1067275 -0.2294213 0.0361328 0.0029925 0.5174877 -0.1696751 -0.0577004 -0.0747173 -0.0102647 -0.2219081 -0.5136403 0.2469942 -0.0229611 -0.1543041 0.0373454 -0.0169663 0.0742641 -0.0749096 -0.2402318 0.2576032 0.0808579 -0.0777543 -0.0720688 0.1548922 -0.0338754 -0.0585564 -0.0482863 -0.1223469 0.1941445 -0.1028263 -0.0333182 0.0070574 0.2215979 -0.0596155 -0.0517834 -0.0292208 -0.122605 -0.1704442 -0.0781556 -0.0068269 -0.0562125 -0.2542065 0.0246657 -0.0009254 0.0173491 -0.2242547 -0.076666 0.0635021 0.0700629 0.0799116 -0.0044851 -0.0941343 0.0215989 -0.0724359 0.0452514 0.0540998 0.0169738 -0.0605812 -0.0694026 -0.0355936 0.1206676 -0.0432647 0.0577013 -0.0094646 0.0816326 -0.0892737 0.0830458 0.0275177 -0.0305049 0.0286444 0.0303747 0.1265883 -0.1279937 -0.1370923 0.1102734 0.0200623 0.0302151 0.0814104 0.0023099 0.0354013 -0.0131928 0.1069706 0.0473973 -0.1680636 -0.0969365 -0.0304628 -0.1007368 -0.0613391 -0.0707846 -0.0954938 -0.0321438 -0.0131687 0.0294998 0.0930427 0.0001423 -0.0110781 -0.0450769 0.0677405 -0.0290217 0.0430195 -0.0164837 -0.0324646 -0.0169203 0.0116351 -0.0396716 0.1155839 -0.0261424 0.0720345 -0.0011139 -0.0621264 -0.0946759 0.0408867 -0.1051617 0.0343738 0.0238024 0.0472624 0.0269984 0.1480571 0.0968691 0.032772 0.0092346 0.0229851 -0.1103823 0.0324101 0.0098775 0.026612 0.1609095 0.0833584 0.0102368 0.00834 0.0373515 -0.1320207 0.0345104 0.0076777 0.0340067 0.1462127 -0.0718876 -0.0934901 0.0477884 -0.1120572 0.0177783 0.0363491 0.0520507 0.0354676 0.1394157 -0.0983456 0.0882374 0.0324542 0.0919431 0.0432225 0.0028029 0.0341884 0.00233 0.1722048 unknown
polarizability: 163.8178381|0.4201705|117.415713|-9.9439748|-5.5256012|62.3383178 unknown
InChI: InChI=1S/C9H12ClN/c1-11(8-7-10)9-5-3-2-4-6-9/h2-6H,7-8H2,1H3
charge 0 multiplicity 1
23 atoms
Cl 4.173981 1.413355 0.115392
N  0.787794 -0.966304 -0.258611
C  1.994257 -0.210922 -0.619962
C  -0.463321 -0.332139 -0.12001
C  0.910352 -2.410522 -0.016122
C  2.651667 0.406841 0.629989
C  -0.612652 1.0822 -0.279792
C  -1.634807 -1.093284 0.184832
C  -1.876565 1.691766 -0.154168
C  -2.891182 -0.465904 0.310511
C  -3.030614 0.929967 0.141688
H  2.716084 -0.884691 -1.114172
H  1.755683 0.58458 -1.348052
H  0.58321 -2.689428 1.005491
H  1.964862 -2.710031 -0.1271
H  0.311164 -3.000435 -0.739444
H  1.985647 1.112355 1.147153
H  3.023722 -0.357985 1.327528
H  0.252404 1.715965 -0.498252
H  -1.57128 -2.17694 0.317362
H  -1.955732 2.777485 -0.284035
H  -3.769566 -1.079935 0.541792
H  -4.008507 1.411506 0.241382
