program: Gaussian 09
title: 000206434
version: EM64L-G09RevD.01
frameworkgroup: C1[X(C18H17ClN2O4)]
method: RPBEPBE
basis: SDD
operation: Freq
keyword: #p
keyword: freq=noraman
keyword: PBEPBE/SDD
title: #p freq=noraman PBEPBE/SDD
converged: YES YES NO NO
title: Mulliken charges:
elementType: Cl O O O O N N C C C C C C C C C C C C C C C C C C H H H H H H H H H H H H H H H H H
charge: -0.048582 -0.252512 -0.439444 -0.253596 -0.435887 -0.199732 -0.018285 0.355688 0.086948 -0.561301 -0.111772 0.503718 -0.354918 -0.345666 0.227462 -0.206358 -0.235284 -0.152673 -0.339048 -0.430770 -0.345560 -0.287336 -0.197423 -0.204429 -0.111617 0.266138 0.233226 0.250302 0.285212 0.229803 0.231621 0.271777 0.215187 0.262944 0.237652 0.260258 0.168384 0.244509 0.258461 0.261036 0.333946 0.347923
chargesum: 0.00000
title: Mulliken charges with hydrogens summed into heavy atoms:
elementType: Cl O O O O N N C C C C C C C C C C C C C C C C C C
charge: -0.048582 -0.252512 -0.105498 -0.253596 -0.087964 -0.199732 -0.018285 0.355688 0.086948 -0.061937 -0.111772 0.503718 -0.104616 -0.060454 0.227462 0.023445 -0.003663 0.119104 0.139083 -0.193118 -0.085302 0.125557 0.061038 0.056607 -0.111617
polarizability: 3.14730873e+02 6.84461622e+00 2.23426021e+02 -2.35449416e+00 -1.08886205e+01 1.72795287e+02
1716.lowfreq: -4.5941 -0.0018 -0.0016 -0.0013 2.0403 5.4045 7.6880 15.4097 21.0255
frequency: 7.1750 15.2850 20.8593 26.6379 34.6600 46.8754 52.6068 94.7797 106.0026 112.6447 131.5921 144.8458 184.2650 208.4918 222.5265 240.3324 256.5354 257.5844 292.8797 308.4062 331.5740 338.9935 357.2933 393.5200 408.3835 416.8404 430.0779 431.8946 472.4428 486.0455 498.5920 531.3407 533.7930 567.5625 592.9365 610.1570 618.3971 627.7637 653.5334 704.0900 715.6887 733.7215 755.0193 761.9436 780.7010 781.9807 806.7895 814.2778 830.2235 833.8167 867.3691 900.2868 911.0372 936.9342 956.2169 960.8383 972.2715 986.9060 994.0977 997.7019 1001.0585 1008.3399 1018.1566 1065.5134 1066.8696 1072.7638 1095.7451 1114.3470 1120.0869 1146.4888 1153.2662 1161.7807 1185.4403 1202.1538 1208.5477 1217.4387 1251.1190 1263.5684 1286.7030 1299.8394 1307.6050 1327.2268 1332.7786 1348.1584 1355.9272 1369.6116 1378.9236 1385.1671 1385.9433 1401.8102 1405.5263 1419.3557 1452.3886 1458.5734 1467.6495 1469.0897 1480.3797 1485.0116 1584.2679 1590.2857 1603.2051 1614.2565 1626.3105 2911.7696 3006.7714 3017.7139 3071.6667 3075.1046 3091.8369 3100.8399 3124.5305 3136.7273 3140.2813 3152.7001 3168.2050 3170.5387 3173.3501 3182.8548 3516.3860 3520.3270
redmass: 6.7187 5.0590 5.5232 7.4491 7.0774 6.9403 5.6009 6.9632 4.8595 4.4187 4.2485 6.6368 6.2832 5.0894 5.6838 5.8026 5.1899 6.4540 4.4136 3.0041 6.7149 2.9754 1.1873 8.2166 2.9226 3.8882 3.4218 3.0238 3.3328 3.2427 1.1854 5.2979 3.3893 4.0104 6.1750 7.1596 7.4373 6.7537 5.2955 4.3373 5.5814 4.3975 4.7529 1.6257 3.6108 3.8998 4.0036 3.3183 1.5440 1.3792 1.4386 7.1825 1.9429 1.6951 1.3680 1.7166 1.4207 2.9261 1.3223 4.3571 4.2795 2.2030 2.8598 4.0309 2.7464 2.7842 2.3388 1.4161 2.1204 1.5080 1.2732 1.3302 1.1202 2.3610 2.7771 1.2678 1.3663 1.5663 1.6839 1.6025 1.2195 2.0976 1.2939 2.5880 1.3818 2.8573 1.2248 4.5195 1.3259 2.3331 2.4347 7.9849 1.2271 1.3104 1.0931 2.5352 2.2240 3.4525 7.2165 7.2991 6.1765 10.6882 7.6741 1.0717 1.0618 1.0581 1.1005 1.0865 1.0929 1.1047 1.0904 1.0862 1.0901 1.0907 1.0972 1.0953 1.0961 1.0978 1.0652 1.0656
irintensity: 0.0587 0.4212 0.0752 0.9433 1.4566 1.7205 2.0410 0.6096 1.9195 7.5763 3.0214 4.0516 0.2756 3.9012 1.0903 3.8535 2.3427 6.8475 3.6553 23.3105 0.1839 0.1010 70.0070 15.1034 0.6770 15.7891 5.9166 5.0793 3.0173 11.2451 201.3612 2.8960 55.8883 3.6771 4.6139 10.4523 3.3663 0.4851 21.5836 0.7755 0.2695 6.2726 3.2455 71.7978 66.8624 16.0410 24.6068 25.8418 25.1961 13.5875 0.8361 16.9450 15.8159 17.0230 2.8275 15.6915 3.2653 99.4129 1.3831 174.5652 36.9364 29.0732 104.0921 164.6017 32.1010 45.8450 175.8575 4.1530 20.4034 128.8721 48.1738 49.9917 1.3637 60.4663 4.7266 42.5479 21.2651 14.5870 6.7684 25.4944 4.2041 47.8102 22.7738 35.6171 21.2366 15.3252 14.8620 3.8445 24.5737 42.6828 15.2151 28.3727 32.9844 22.4213 2.2486 99.6297 57.5203 21.1638 7.6817 2.9854 11.2972 192.4245 24.9064 72.7826 26.9285 46.6549 1.6419 4.3619 23.3126 12.6617 10.6853 3.0079 3.5188 16.4936 14.2266 4.0854 0.8178 8.5259 15.5488 2.0279
temp: 298.150 k
press: 1.00000 atm
elementType: 17 8 8 8 8 7 7 6 6 6 6 6 6 6 6 6 6 6 6 6 6 6 6 6 6 1 1 1 1 1 1 1 1 1 1 1 1 1 1 1 1 1
symmnumber: 1
zpe: 836299.3 jmol-1
zpe.correction: 0.318530 hartree
zpe.thermalcorrener: 0.341597 hartree
zpe.thermalcorrenthalpy: 0.342541 hartree
zpe.thermalcorrgfe: 0.260410 hartree
zpe.sumelectzpe: -1564.751034 hartree
zpe.sumelectthermal: -1564.727967 hartree
zpe.sumelectthermalent: -1564.727023 hartree
zpe.sumelectthermalfe: -1564.809153 hartree
dipole: 1.6851 2.3602 3.7750
dipole: 4.7604
quadrupole: -143.2988 -156.9528 -149.6613
quadrupole: 16.6068 -5.6404 -5.9535
quadrupole: 6.6722 -6.9818 0.3096 16.6068 -5.6404 -5.9535
hfenergy: -1565.0695634 hartree
pointgroup: C01 [X(C18H17Cl1N2O4)]
dipole: 0.7257775 0.8471311 1.5044107 debye
polarizability: 313.349227|-11.4238739|223.376397|6.9831303|-13.7230734|174.2265571 unknown
InChI: InChI=1S/C18H17ClN2O4/c19-13-7-5-12(6-8-13)9-21-16-4-2-1-3-15(16)17(20-21)18(24)25-11-14(23)10-22/h1-8,14,22-23H,9-11H2
charge 0 multiplicity 1
42 atoms
Cl 5.416785 -4.094187 -0.653885
O  -3.300859 0.488677 0.561192
O  -6.49064 -0.724494 -1.064168
O  -2.995733 2.107804 -1.105043
O  -4.905616 -3.115911 -1.21448
N  0.771355 0.695644 1.123162
N  -0.592751 0.447345 1.086552
C  1.156243 1.6869 0.214166
C  -0.045295 2.108588 -0.445828
C  1.613422 -0.068964 2.053339
C  -1.093579 1.300921 0.138822
C  2.55951 -1.045921 1.359823
C  2.422116 2.245235 -0.081341
C  0.010073 3.125911 -1.434163
C  -2.518965 1.358669 -0.213599
C  2.453058 3.252638 -1.062549
C  1.264784 3.687972 -1.72932
C  -5.041344 -0.700183 -0.740598
C  -4.750138 0.451833 0.237086
C  3.928634 -1.089647 1.714443
C  2.072431 -1.947312 0.379895
C  -4.614112 -2.082668 -0.221941
C  4.807319 -2.017555 1.109623
C  2.935587 -2.876215 -0.239245
C  4.293209 -2.896809 0.13878
H  0.90544 -0.60603 2.708157
H  2.188027 0.63601 2.6826
H  3.336401 1.904939 0.413651
H  -0.903942 3.447666 -1.940017
H  3.411248 3.712954 -1.327454
H  1.341369 4.474263 -2.4879
H  -4.565862 -0.502712 -1.715496
H  -5.245597 0.288713 1.211776
H  -5.064743 1.41166 -0.206726
H  4.322249 -0.399764 2.470958
H  1.014258 -1.923608 0.095519
H  -5.132977 -2.293471 0.743288
H  -3.527187 -2.115194 -0.0460
H  5.865252 -2.051628 1.384636
H  2.56084 -3.570632 -0.996624
H  -7.006913 -0.835405 -0.222203
H  -5.807957 -2.919136 -1.582386
