program: Gaussian 09
title: 000206431
version: EM64L-G09RevD.01
frameworkgroup: C1[X(C15H9Cl3N2O2)]
method: RPBEPBE
basis: SDD
operation: Freq
keyword: #p
keyword: freq=noraman
keyword: PBEPBE/SDD
title: #p freq=noraman PBEPBE/SDD
converged: YES YES NO NO
title: Mulliken charges:
elementType: Cl Cl Cl O O N N C C C C C C C C C C C C C C C H H H H H H H H H
charge: 0.007087 0.007382 0.018743 -0.401788 -0.260715 -0.198659 -0.003833 0.365947 -0.546026 0.069951 0.650433 -0.064631 -0.333363 -0.346241 -0.348318 -0.392585 -0.218703 -0.234475 0.146769 -0.093250 -0.184906 -0.102904 0.245358 0.275903 0.251368 0.286529 0.275167 0.230017 0.231656 0.287017 0.381071
chargesum: 0.00000
title: Mulliken charges with hydrogens summed into heavy atoms:
elementType: Cl Cl Cl O O N N C C C C C C C C C C C C C C C
charge: 0.007087 0.007382 0.018743 -0.020716 -0.260715 -0.198659 -0.003833 0.365947 -0.024765 0.069951 0.650433 -0.064631 -0.081995 -0.059712 -0.348318 -0.117417 0.011314 -0.002819 0.146769 -0.093250 0.102111 -0.102904
polarizability: 2.95878605e+02 -4.06796330e+01 2.01395192e+02 -8.06754762e+00 -6.91709758e+00 1.42683290e+02
1716.lowfreq: -7.3358 -4.3296 -0.0015 -0.0010 0.0011 4.7148 14.1144 27.8106 29.3727
frequency: 14.0193 27.7950 29.3421 58.6764 65.7308 118.3561 122.9127 126.2846 142.3740 173.7055 182.9691 198.4894 218.2346 236.1181 261.4952 308.8791 323.2243 334.4296 337.2960 397.0976 408.7871 432.4874 447.8297 479.3820 515.6429 533.0402 555.3223 568.5524 579.4243 595.4231 616.6395 637.9064 661.5326 669.8536 693.5920 721.8363 742.5385 754.3422 762.2600 783.1432 787.4004 864.5168 869.0440 879.4832 893.8370 950.3631 957.7835 967.4343 995.3093 1010.1788 1036.3377 1049.1877 1089.1643 1124.8794 1136.5125 1148.8364 1181.5376 1208.1590 1241.8404 1264.1784 1275.0810 1287.3693 1305.9595 1345.1202 1353.4658 1367.7127 1390.0358 1409.6793 1423.7840 1443.1295 1459.1538 1470.8921 1485.8280 1557.4864 1584.0127 1586.8406 1623.5961 1630.2965 2999.1096 3075.3706 3137.0707 3148.9060 3154.8914 3174.9267 3181.4020 3183.2817 3518.6047
redmass: 9.9742 9.8717 10.6319 11.6971 16.1182 9.0128 6.7961 5.4949 7.8549 10.8196 15.0019 10.7328 5.7914 6.5756 2.9666 15.4813 8.6518 7.8988 6.4775 8.3790 7.1191 3.0552 3.2777 5.2756 5.3047 7.6617 1.6187 4.0882 5.4457 6.9352 6.7887 2.9140 6.7891 4.9423 5.2040 5.3431 4.8352 5.4100 1.5940 4.5944 4.5142 1.4593 1.4329 4.2752 1.5593 2.3240 1.3752 6.9885 1.3127 2.2196 5.5239 3.9104 2.8892 1.9927 1.4493 1.8098 1.2764 4.1811 1.2248 1.5857 2.2990 1.9724 2.7862 5.0357 2.6349 5.8533 2.1302 3.0494 6.3551 2.1790 1.6323 2.5650 3.9421 8.4721 7.1751 7.9985 7.9604 7.9622 1.0638 1.0983 1.0865 1.0921 1.0913 1.0956 1.0932 1.0981 1.0640
irintensity: 0.1973 0.4079 0.0828 1.0791 0.5739 0.6383 1.9247 0.4212 0.7715 2.0095 0.6127 1.1401 0.5026 0.5763 4.3649 0.6168 1.1940 0.5883 4.0840 6.2910 4.1800 8.3606 10.3990 2.6154 8.5705 26.9252 58.1786 12.2406 17.3297 30.0241 2.7827 93.5172 24.7101 24.8698 9.5950 1.1904 3.2140 4.4184 77.9182 24.5919 14.2491 8.4103 2.0531 35.1503 31.8734 40.5319 4.1679 150.6812 0.2923 25.4869 43.5381 264.0248 74.3267 33.7588 42.9121 39.1378 8.6187 18.0004 3.0434 13.4000 5.2490 14.3068 54.1227 75.8517 24.0505 3.8073 2.9415 23.9906 40.0860 77.4933 59.4493 82.4496 23.5574 2.5389 9.1816 16.8066 27.2327 275.1384 31.1767 2.5923 3.9634 0.6813 16.4378 9.2928 1.4563 8.6192 49.5371
temp: 298.150 k
press: 1.00000 atm
elementType: 17 17 17 8 8 7 7 6 6 6 6 6 6 6 6 6 6 6 6 6 6 6 1 1 1 1 1 1 1 1 1
symmnumber: 1
zpe: 544695.4 jmol-1
zpe.correction: 0.207464 hartree
zpe.thermalcorrener: 0.226638 hartree
zpe.thermalcorrenthalpy: 0.227582 hartree
zpe.thermalcorrgfe: 0.156788 hartree
zpe.sumelectzpe: -2215.591158 hartree
zpe.sumelectthermal: -2215.571984 hartree
zpe.sumelectthermalent: -2215.571039 hartree
zpe.sumelectthermalfe: -2215.641834 hartree
dipole: -2.0038 0.9571 1.1543
dipole: 2.5027
quadrupole: -162.1374 -139.5401 -142.5016
quadrupole: -0.7137 0.4648 0.4416
quadrupole: -14.0777 8.5195 5.5581 -0.7137 0.4648 0.4416
hfenergy: -2215.7986216 hartree
pointgroup: C01 [X(C15H9Cl3N2O2)]
dipole: -0.6773411 0.5381092 0.4702788 debye
polarizability: 272.1065056|-57.4618488|225.3351064|-11.2679449|-2.4534899|142.5154749 unknown
InChI: InChI=1S/C15H9Cl3N2O2/c16-10-6-12(18)11(17)5-8(10)7-20-13-4-2-1-3-9(13)14(19-20)15(21)22/h1-6,21H,7H2
charge 0 multiplicity 1
31 atoms
Cl -1.200115 -2.404723 -0.780078
Cl -4.725171 2.560576 1.259348
Cl -5.643352 0.803499 -1.375827
O  3.871404 -3.116099 0.556691
O  4.960774 -1.44809 -0.642656
N  0.782916 -0.399727 0.96699
N  1.681933 -1.455536 0.958218
C  1.272773 0.724125 0.287235
C  -0.472854 -0.56851 1.715413
C  2.571115 0.352802 -0.197981
C  -1.730206 -0.23507 0.922261
C  2.763533 -1.008748 0.251852
C  0.72257 2.008616 0.060144
C  3.34804 1.282051 -0.936845
C  -2.162037 -0.979396 -0.203058
C  -2.548726 0.842257 1.33903
C  1.511762 2.915368 -0.670945
C  2.805186 2.559147 -1.164234
C  3.951447 -1.834907 0.004139
C  -3.737899 1.171402 0.659472
C  -3.342145 -0.664096 -0.901149
C  -4.133026 0.419224 -0.466898
H  -0.443221 0.059699 2.625603
H  -0.4734 -1.62661 2.028895
H  -0.269633 2.290396 0.421647
H  4.335798 0.995023 -1.306732
H  -2.255719 1.434386 2.212594
H  1.123391 3.920159 -0.870592
H  3.379506 3.300444 -1.730039
H  -3.651991 -1.253942 -1.767262
H  4.713449 -3.600122 0.337566
