program: Gaussian 09
title: 000206430
version: EM64L-G09RevD.01
frameworkgroup: C1[X(C15H11FN2O2)]
method: RPBEPBE
basis: SDD
operation: Freq
keyword: #p
keyword: freq=noraman
keyword: PBEPBE/SDD
title: #p freq=noraman PBEPBE/SDD
converged: YES YES NO NO
title: Mulliken charges:
elementType: F O O N N C C C C C C C C C C C C C C C H H H H H H H H H H H
charge: -0.202603 -0.404094 -0.260824 -0.197801 -0.015385 0.361869 -0.569900 0.077563 -0.066110 0.504253 -0.350651 -0.341359 -0.203740 -0.234586 -0.327448 -0.408126 0.144195 -0.357711 -0.356635 0.318864 0.230997 0.267097 0.246093 0.285285 0.229253 0.231140 0.265500 0.235488 0.260020 0.258545 0.380811
chargesum: 0.00000
title: Mulliken charges with hydrogens summed into heavy atoms:
elementType: F O O N N C C C C C C C C C C C C C C C
charge: -0.202603 -0.023283 -0.260824 -0.197801 -0.015385 0.361869 -0.071806 0.077563 -0.066110 0.504253 -0.104558 -0.056074 0.025513 -0.003447 -0.061948 -0.172638 0.144195 -0.097691 -0.098090 0.318864
polarizability: 2.22609525e+02 -2.08158341e+01 1.92936436e+02 -1.86665502e+01 2.01625071e+00 1.24701336e+02
1716.lowfreq: -5.6088 -2.8045 0.0007 0.0007 0.0011 5.2695 16.0393 26.9096 33.2628
frequency: 14.3470 26.8207 33.2321 59.5263 113.4458 123.8745 132.1584 154.3638 210.3794 234.0164 275.7182 326.1061 332.8136 346.9170 388.0281 408.7794 412.0124 430.9334 477.7237 511.0832 532.7848 555.8548 569.9976 590.8450 607.7159 626.7877 638.6544 669.1391 703.0468 720.5762 747.8964 757.5940 761.9726 783.1023 784.1781 821.1599 824.8513 840.6700 865.2375 932.1270 952.8848 953.9902 965.9832 970.6043 993.5474 1006.2230 1007.2540 1045.3790 1085.6909 1109.6451 1133.5770 1151.7700 1157.0920 1182.2961 1197.1105 1211.0759 1261.2945 1272.6792 1287.1714 1298.8274 1333.9443 1348.6016 1371.9038 1392.2867 1408.6119 1413.2897 1424.0576 1457.3856 1469.1759 1486.4701 1497.3304 1584.3913 1604.8684 1615.1012 1624.3616 1630.3982 3013.0025 3076.2174 3126.7268 3135.6219 3142.4330 3150.8972 3165.8865 3175.2971 3177.7721 3182.0316 3517.8946
redmass: 6.0540 4.4934 7.3000 10.3576 8.1107 4.6936 6.7357 5.8286 5.7042 6.5390 3.8105 5.3927 6.4281 4.6634 5.3269 5.6469 2.9730 2.9932 4.3607 4.1407 4.7284 1.6604 3.7184 5.3883 4.4972 6.6918 3.1037 4.6222 4.0477 4.9401 3.5957 4.9885 1.7354 4.1589 4.4600 1.5282 2.7288 1.8037 1.4492 1.6738 1.8995 1.3805 3.1103 1.6876 1.3148 2.5669 2.3580 3.6483 2.4010 1.3818 1.4437 1.5908 1.4781 1.3833 1.6995 4.8449 1.5427 2.4330 1.6995 1.6340 1.9196 2.7472 2.8643 4.8301 2.9930 2.6489 6.3686 1.2942 3.0373 3.8722 2.5974 7.2285 7.5555 6.3789 8.0281 7.8863 1.0610 1.1018 1.0905 1.0861 1.0905 1.0907 1.0974 1.0952 1.0961 1.0978 1.0640
irintensity: 0.4943 0.4656 0.1597 1.3377 1.6433 0.3899 1.6640 2.6480 2.2864 0.4484 0.8568 6.0719 1.0894 0.9602 0.5976 6.0989 0.7922 7.7735 17.1818 7.8024 4.7456 56.8118 11.5113 34.6168 28.6431 6.3865 82.6053 33.3832 6.9832 0.8584 25.0122 5.2604 68.8292 17.1521 41.5857 8.8761 15.3248 52.0976 1.4318 8.6633 24.0708 3.1649 109.9394 26.7217 0.3362 16.3101 18.5373 219.5954 98.7430 3.1866 47.6784 39.2186 31.2903 9.7858 17.1221 40.2478 18.9968 6.0460 15.0735 26.2105 29.8224 31.6194 16.6902 2.4565 20.8145 0.6358 35.1182 25.4355 86.0954 23.3972 96.7555 7.0580 7.1321 18.8683 47.3304 253.1450 24.8994 1.4911 11.3057 2.5514 2.6487 16.8262 14.3397 2.7889 2.5782 8.3267 47.8634
temp: 298.150 k
press: 1.00000 atm
elementType: 9 8 8 7 7 6 6 6 6 6 6 6 6 6 6 6 6 6 6 6 1 1 1 1 1 1 1 1 1 1 1
symmnumber: 1
zpe: 598829.8 jmol-1
zpe.correction: 0.228082 hartree
zpe.thermalcorrener: 0.244296 hartree
zpe.thermalcorrenthalpy: 0.245241 hartree
zpe.thermalcorrgfe: 0.181506 hartree
zpe.sumelectzpe: -936.604364 hartree
zpe.sumelectthermal: -936.588150 hartree
zpe.sumelectthermalent: -936.587206 hartree
zpe.sumelectthermalfe: -936.650941 hartree
dipole: -1.4694 1.9288 1.9954
dipole: 3.1402
quadrupole: -128.2875 -102.2152 -112.6626
quadrupole: -4.4972 -7.7225 4.1953
quadrupole: -13.8991 12.1733 1.7258 -4.4972 -7.7225 4.1953
hfenergy: -936.8324466 hartree
pointgroup: C01 [X(C15H11F1N2O2)]
dipole: -0.4566843 0.925187 0.6795847 debye
polarizability: 215.7298858|-26.2907514|199.7899987|-15.3314604|-4.2797023|124.7274137 unknown
InChI: InChI=1S/C15H11FN2O2/c16-11-7-5-10(6-8-11)9-18-13-4-2-1-3-12(13)14(17-18)15(19)20/h1-8,19H,9H2
charge 0 multiplicity 1
31 atoms
F  -5.469312 0.162712 -1.56266
O  2.832841 -3.430041 0.508832
O  4.212465 -2.004591 -0.705139
N  0.425515 -0.120521 1.101751
N  1.071356 -1.345312 1.037097
C  1.103587 0.87671 0.39265
C  -0.847743 -0.021658 1.829908
C  2.273255 0.250649 -0.152283
C  2.192881 -1.127347 0.280846
C  -2.067869 0.043096 0.914114
C  0.808271 2.24491 0.187843
C  3.188727 1.012197 -0.924754
C  1.728833 2.980414 -0.580391
C  2.902899 2.374091 -1.128216
C  -2.262231 -0.945496 -0.084761
C  -3.030723 1.068825 1.069349
C  3.166674 -2.181222 -0.025291
C  -3.397331 -0.91166 -0.920914
C  -4.179008 1.118099 0.246312
C  -4.331403 0.123123 -0.732684
H  -0.813882 0.866114 2.48755
H  -0.88584 -0.918624 2.471701
H  -0.095119 2.710974 0.592496
H  4.081602 0.537215 -1.339524
H  1.541392 4.043328 -0.768466
H  3.588726 2.989251 -1.720546
H  -1.519929 -1.741936 -0.209458
H  -2.891685 1.837254 1.839404
H  -3.563292 -1.663769 -1.697475
H  -4.933046 1.903063 0.352977
H  3.547392 -4.074846 0.254031
