program: Gaussian 09
title: 000206428
version: EM64L-G09RevD.01
frameworkgroup: C1[X(C15H11ClN2O2)]
method: RPBEPBE
basis: SDD
operation: Freq
keyword: #p
keyword: freq=noraman
keyword: PBEPBE/SDD
title: #p freq=noraman PBEPBE/SDD
converged: YES YES NO NO
title: Mulliken charges:
elementType: Cl O O N N C C C C C C C C C C C C C C C H H H H H H H H H H H
charge: -0.059357 -0.403710 -0.260639 -0.200082 -0.016374 0.364115 -0.558839 0.076082 -0.068118 0.509705 -0.350419 -0.342356 -0.204509 -0.234810 -0.420013 -0.366863 0.144533 -0.074550 -0.197748 -0.237722 0.233649 0.268995 0.250285 0.285395 0.230111 0.231272 0.259598 0.263044 0.237662 0.260800 0.380865
chargesum: 0.00000
title: Mulliken charges with hydrogens summed into heavy atoms:
elementType: Cl O O N N C C C C C C C C C C C C C C C
charge: -0.059357 -0.022845 -0.260639 -0.200082 -0.016374 0.364115 -0.056195 0.076082 -0.068118 0.509705 -0.100134 -0.056961 0.025601 -0.003538 -0.160415 -0.103819 0.144533 -0.074550 0.039914 0.023078
polarizability: 2.57562843e+02 2.68671990e+01 1.89928572e+02 -1.68835273e+01 -5.55433560e-01 1.25111912e+02
1716.lowfreq: -5.0442 -2.1670 -0.0010 0.0003 0.0016 2.6309 10.9653 18.7055 37.8796
frequency: 10.7117 18.6728 37.8789 59.8172 123.0379 124.2747 142.5662 158.5297 181.4856 197.5704 235.3406 261.0525 331.7345 340.7692 346.0012 390.9226 411.4755 431.5784 432.6898 497.4156 534.9949 555.0940 561.7718 571.4114 591.1091 623.7769 639.4281 662.1535 676.0962 707.0347 722.0681 755.6810 762.8643 775.6670 784.6221 801.1719 843.5351 869.4153 882.6439 914.4803 951.5474 957.2456 967.1832 985.5128 988.2500 994.7341 1007.2066 1046.5227 1073.2342 1086.6595 1099.2449 1134.1807 1151.9674 1179.9298 1182.5781 1207.7623 1261.1456 1272.6800 1283.6847 1301.4077 1332.9510 1348.9857 1371.5175 1383.3095 1409.3666 1422.8216 1427.5348 1454.2152 1466.8737 1472.0956 1486.7959 1581.1682 1584.5725 1609.2249 1624.3828 1630.7185 3009.5673 3075.4017 3136.4005 3138.1138 3147.2660 3152.0006 3156.6922 3167.5483 3177.8187 3182.6997 3517.8563
redmass: 6.5506 8.0499 6.3394 9.7728 5.7610 6.9497 5.2076 6.1958 5.8864 5.2493 6.6485 2.9697 6.4186 7.1780 3.7473 10.9205 4.7881 3.1054 3.2018 4.2266 5.9651 1.6141 5.2335 3.9203 5.5392 4.1145 3.4350 5.9757 3.9222 3.2327 4.9817 4.4618 1.6386 2.8980 3.8532 1.7926 4.5613 1.4329 1.4510 1.3768 2.5596 1.3736 5.8208 5.3302 1.4046 1.3126 2.1749 3.6806 2.1766 2.3490 1.6841 1.4488 1.6193 1.0912 1.3660 2.5687 1.5347 2.4237 1.6881 1.7381 1.7448 2.7230 3.0037 5.1459 3.0384 5.4319 2.6504 1.3282 3.3878 2.0906 3.8421 6.5742 7.1812 6.5666 7.9885 7.9392 1.0616 1.1008 1.0862 1.0877 1.0924 1.0907 1.0941 1.0973 1.0977 1.0977 1.0640
irintensity: 0.6155 1.0750 0.1753 1.3719 1.8067 0.7599 3.4931 2.1863 0.2119 0.3711 0.5878 3.9123 1.2534 2.6323 0.5212 10.8844 3.2002 5.4704 4.9572 1.0786 0.1036 56.7907 8.8745 15.1514 39.5721 37.1016 73.9269 10.9664 15.0854 42.3145 3.3849 9.3785 79.0647 73.3830 16.9281 15.5495 18.5157 1.1176 13.1553 1.8839 56.3687 3.8467 137.5314 1.6640 0.0523 0.3290 21.1626 218.9903 19.9849 56.1920 32.9542 46.3817 28.6204 1.2605 8.3666 35.5723 15.9550 5.9247 5.2385 31.5893 36.9032 30.5195 21.3916 1.5014 25.7556 45.5150 14.2705 16.1904 68.6373 51.0262 23.6356 37.2891 12.0116 33.8995 34.9430 260.1631 23.8960 1.7976 2.8646 3.2611 3.1808 16.6149 5.5096 13.0124 5.1131 7.9923 48.6714
temp: 298.150 k
press: 1.00000 atm
elementType: 17 8 8 7 7 6 6 6 6 6 6 6 6 6 6 6 6 6 6 6 1 1 1 1 1 1 1 1 1 1 1
symmnumber: 1
zpe: 595555.6 jmol-1
zpe.correction: 0.226835 hartree
zpe.thermalcorrener: 0.243439 hartree
zpe.thermalcorrenthalpy: 0.244383 hartree
zpe.thermalcorrgfe: 0.179215 hartree
zpe.sumelectzpe: -1296.823718 hartree
zpe.sumelectthermal: -1296.807114 hartree
zpe.sumelectthermalent: -1296.806170 hartree
zpe.sumelectthermalfe: -1296.871338 hartree
dipole: 1.6174 0.4709 -0.0946
dipole: 1.6872
quadrupole: -136.6295 -113.0724 -116.6360
quadrupole: -0.0769 1.9672 -3.9570
quadrupole: -14.5168 9.0402 5.4766 -0.0769 1.9672 -3.9570
hfenergy: -1297.0505528 hartree
pointgroup: C01 [X(C15H11Cl1N2O2)]
dipole: -0.5963714 0.2881562 0.0439296 debye
polarizability: 245.2508962|-37.9230592|200.1922736|-19.9989908|-1.999724|127.1601579 unknown
InChI: InChI=1S/C15H11ClN2O2/c16-11-5-3-4-10(8-11)9-18-13-7-2-1-6-12(13)14(17-18)15(19)20/h1-8,19H,9H2
charge 0 multiplicity 1
31 atoms
Cl -5.721658 1.499146 0.522365
O  3.299524 -3.185663 0.44456
O  4.486764 -1.51335 -0.651823
N  0.387557 -0.314693 1.055016
N  1.216916 -1.422918 0.97094
C  0.932423 0.807719 0.42176
C  -0.905783 -0.439881 1.739172
C  2.205487 0.393443 -0.092508
C  2.32048 -1.000401 0.277951
C  -2.099932 -0.42711 0.78633
C  0.438968 2.123681 0.260571
C  3.02377 1.321079 -0.788656
C  1.266141 3.026099 -0.432258
C  2.540552 2.632029 -0.948659
C  -3.200864 0.42318 1.047208
C  -2.129529 -1.285764 -0.341269
C  3.456304 -1.87822 -0.025924
C  -4.3082 0.396112 0.177394
C  -3.248962 -1.290037 -1.19995
C  -4.356857 -0.445794 -0.948111
H  -0.999806 0.371898 2.483825
H  -0.854818 -1.397476 2.285551
H  -0.540916 2.427425 0.640559
H  3.994909 1.007188 -1.180166
H  0.925285 4.056066 -0.584484
H  3.147133 3.372103 -1.481524
H  -3.198892 1.093886 1.913212
H  -1.276546 -1.943263 -0.542952
H  -3.269421 -1.952886 -2.071337
H  -5.228284 -0.443996 -1.608816
H  4.113656 -3.702404 0.196723
