program: Gaussian 09
title: 000015475
version: EM64L-G09RevD.01
frameworkgroup: C1[X(C8H14O)]
method: RPBEPBE
basis: SDD
operation: Freq
keyword: #pfreq=noraman
keyword: PBEPBE/SDD
title: #p freq=noraman PBEPBE/SDD
converged: YES YES NO NO
title: Mulliken charges:
elementType: O C C C C C C C C H H H H H H H H H H H H H H
charge: -0.236665 -0.348890 -0.343790 -0.464626 -0.691556 -0.079955 -0.320610 0.194879 -0.781799 0.199690 0.207968 0.196974 0.194739 0.206005 0.210759 0.217980 0.211908 0.212137 0.264853 0.228556 0.233392 0.254066 0.233984
chargesum: 0.00000
title: Mulliken charges with hydrogens summed into heavy atoms:
elementType: O C C C C C C C C
charge: -0.236665 0.058768 0.047923 -0.047861 -0.049531 0.184897 -0.092053 0.194879 -0.060356
polarizability: 1.33657564e+02 2.23637346e+00 8.22224863e+01 -7.79860932e+00 -3.03944725e+00 6.74907996e+01
1716.lowfreq: -14.3409 -7.3321 -0.0007 0.0002 0.0004 0.8719 32.7212 58.1912 66.7804
frequency: 32.5174 57.9136 66.7748 98.9049 102.7691 139.2998 180.1853 209.9244 229.3551 277.5367 369.5477 435.1941 440.3037 567.8073 600.2977 727.6910 775.9104 835.2143 868.0984 898.8016 928.0540 948.2764 992.4444 1009.5682 1026.2540 1041.2151 1067.8143 1103.0712 1136.3235 1186.8021 1210.3986 1242.0082 1266.6076 1281.2575 1291.0337 1304.1428 1333.5591 1345.8139 1366.3434 1390.2678 1442.4327 1455.1700 1456.1897 1467.0250 1476.6234 1477.0512 1487.2018 1583.9837 1658.2083 2952.9855 2964.5033 2974.1673 2975.9596 2977.2345 3004.9352 3020.5628 3045.5631 3059.5387 3071.3768 3073.9511 3084.6476 3106.7983 3124.1832
redmass: 2.9177 1.8258 4.0665 1.1441 1.9861 2.5692 2.9907 2.3060 1.2556 3.5506 2.6609 2.7482 3.3424 2.5434 3.9570 1.0795 1.2243 1.5524 2.2992 2.1009 1.5998 1.5713 1.3371 2.2016 1.8465 1.7209 2.5780 2.0144 1.8840 1.8630 1.6372 1.3450 1.2479 1.1619 1.2056 1.4282 1.5732 1.5600 1.2707 1.2124 1.0860 1.0503 1.0935 1.0698 1.0663 1.0444 1.0824 7.6536 6.2014 1.0620 1.0586 1.0400 1.0564 1.0375 1.0978 1.0984 1.1034 1.0963 1.1008 1.0993 1.0909 1.0907 1.0993
irintensity: 1.8180 0.5278 2.0465 0.0123 0.5352 0.5287 2.9288 0.0891 0.2272 0.2190 1.7948 2.3636 6.8310 1.8290 10.2945 10.8217 3.5306 0.2690 2.5697 1.7684 21.8839 25.3850 32.3070 20.3402 3.0767 23.3821 1.8485 12.5959 3.6629 36.3791 21.3700 25.0689 3.7516 11.6969 17.0713 16.6936 35.1100 2.1536 73.4833 11.5767 28.6024 20.1238 5.0385 0.8879 5.7420 12.1011 17.4940 182.2576 119.3273 14.2025 11.7800 22.4940 79.2775 4.1388 4.9574 4.4022 42.6312 15.5161 84.6335 50.8375 8.6242 17.9382 19.3080
temp: 298.150 k
press: 1.00000 atm
elementType: 8 6 6 6 6 6 6 6 6 1 1 1 1 1 1 1 1 1 1 1 1 1 1
symmnumber: 1
zpe: 522323.1 jmol-1
zpe.correction: 0.198942 hartree
zpe.thermalcorrener: 0.210578 hartree
zpe.thermalcorrenthalpy: 0.211522 hartree
zpe.thermalcorrgfe: 0.160039 hartree
zpe.sumelectzpe: -387.731426 hartree
zpe.sumelectthermal: -387.719790 hartree
zpe.sumelectthermalent: -387.718846 hartree
zpe.sumelectthermalfe: -387.770330 hartree
dipole: 2.0666 -2.9125 0.2429
dipole: 3.5795
quadrupole: -57.5826 -58.9546 -56.1832
quadrupole: 9.5106 -2.9134 -0.6108
quadrupole: -0.0091 -1.3811 1.3903 9.5106 -2.9134 -0.6108
hfenergy: -387.9303682 hartree
pointgroup: C01 [X(C8H14O1)]
dipole: 0.8285817 -1.1329578 0.1143829 debye
dipolederiv: -0.7344564 0.0526113 0.0663323 0.3799481 -0.8343999 0.0529734 0.0126862 0.1028979 -0.347997 0.0340477 0.0162861 -0.0101699 0.227302 0.1185823 -0.0634232 0.1116388 -0.0457977 0.1225938 0.0656759 -0.0038634 -0.0265388 -0.1068553 0.1293689 -0.0434697 -0.1097337 -0.044832 0.136206 -0.3685983 0.0126318 -0.0129686 -0.1032049 0.125393 -0.0176401 -0.0027239 -0.0555645 0.1082686 -0.092749 -0.0343364 -0.0532113 0.0203784 0.0675361 -0.0294802 -0.0130706 -0.0293747 0.0557682 0.6459128 -0.0368781 -0.135037 0.0522314 0.0817179 -0.0910085 -0.29052 -0.0485359 -0.078633 -1.183482 0.0489728 0.1337134 -0.0977367 0.0510177 -0.035553 0.2745337 -0.0698881 -0.2515068 1.6523656 0.0568617 -0.3161591 -0.3380323 0.8591322 -0.1087094 -0.2711979 -0.170918 0.2495972 -0.3489576 -0.2198293 0.1330691 -0.3183029 -0.2195521 0.1310197 0.1603675 0.1105747 -0.0132221 0.0513715 0.0084241 -0.0106104 0.006442 -0.173899 0.0237737 -0.0034298 0.050268 0.0586965 0.0296466 -0.0023314 0.0437149 -0.0116492 0.0637876 0.0206609 0.0264362 -0.0028454 -0.1628585 0.0315498 -0.0339247 -0.0069374 0.0140378 -0.2010954 0.021136 -0.0077208 0.0425615 0.0654232 0.0185116 -0.0009695 0.016609 -0.0020563 0.0709601 0.0211608 0.0541771 -0.006691 -0.2043627 0.0106946 0.0038904 0.0930092 0.0611671 0.0807641 0.0224695 0.0538291 0.0043633 -0.1249121 0.0260508 -0.0212257 0.0003103 0.0201665 -0.1562527 0.015352 -0.0270947 0.0632672 0.065988 -0.218187 0.0666568 0.0106937 0.08638 0.0570405 -0.0235366 0.0207917 -0.0279994 0.0824903 0.0820478 -0.0178493 0.076031 -0.0271207 0.0789897 0.0276034 0.0101328 0.0078058 -0.1744473 0.0928275 0.0151119 -0.0179891 -0.0486037 -0.1753993 0.0307522 -0.0129289 0.0612772 0.0664375 0.0812868 0.018289 0.010581 0.0219406 -0.0451923 0.0385618 0.0269055 0.0299241 0.1298899 0.0614135 0.0256744 0.0205663 0.0295868 -0.10757 0.053743 0.0164696 0.0547345 0.1441155 0.0567356 0.0131464 -0.0773436 0.0315068 0.0865867 0.0746096 -0.0337971 0.0903328 -0.0523331 -0.074734 0.0533964 0.0336337 0.118655 0.0430941 -0.0125585 0.0227453 0.0035524 0.1143081 0.0810263 -0.0207453 0.0287013 -0.0161806 -0.0006102 -0.1084368 -0.018496 -0.1191128 0.0104897 unknown
polarizability: 133.7510313|2.9662323|82.2468923|-7.0144767|-3.2405151|67.3729268 unknown
InChI: InChI=1S/C8H14O/c1-3-4-5-6-7-8(2)9/h6-7H,3-5H2,1-2H3
charge 0 multiplicity 1
23 atoms
O  -2.924412 1.343112 -0.157791
C  2.120323 0.221162 0.136775
C  3.538931 -0.338357 -0.115196
C  1.03655 -0.493539 -0.720368
C  4.616374 0.366136 0.736892
C  -0.334237 0.098645 -0.5259
C  -1.442234 -0.571433 -0.095286
C  -2.761365 0.108128 0.07789
C  -3.914033 -0.769217 0.556553
H  2.106966 1.307602 -0.086098
H  1.863696 0.117414 1.209733
H  3.546706 -1.426152 0.100847
H  3.786758 -0.232334 -1.191165
H  1.326335 -0.392805 -1.788614
H  1.02945 -1.576144 -0.488724
H  5.621041 -0.052353 0.543581
H  4.404915 0.252946 1.816813
H  4.652701 1.449184 0.514437
H  -0.454801 1.173375 -0.738524
H  -1.391936 -1.644433 0.137317
H  -3.668163 -1.231949 1.531717
H  -4.831688 -0.169982 0.656561
H  -4.090677 -1.596607 -0.157352
