program: Gaussian 09
title: 000206420
version: EM64L-G09RevD.01
frameworkgroup: C1[X(C19H33NO)]
method: RPBEPBE
basis: SDD
operation: Freq
keyword: #p
keyword: freq=noraman
keyword: PBEPBE/SDD
title: #p freq=noraman PBEPBE/SDD
converged: YES YES NO NO
title: Mulliken charges:
elementType: O N C C C C C C C C C C C C C C C C C C C H H H H H H H H H H H H H H H H H H H H H H H H H H H H H H H H H
charge: -0.475835 -0.053737 -0.070054 0.296265 -0.559825 -0.484306 0.031076 -0.454351 -0.052634 -0.564009 -0.758965 -0.748854 -0.729342 -0.058696 -0.362515 -0.368702 -0.408789 -0.395902 -0.392342 -0.400391 -0.074105 0.234632 0.215799 0.230580 0.208746 0.194068 0.192312 0.185513 0.231268 0.204741 0.240669 0.252943 0.217632 0.208275 0.212749 0.210214 0.225200 0.216688 0.213211 0.212202 0.214025 0.331759 0.168633 0.225415 0.212399 0.167846 0.195627 0.205565 0.207784 0.192606 0.214721 0.237740 0.214875 0.189578
chargesum: 0.00000
title: Mulliken charges with hydrogens summed into heavy atoms:
elementType: O N C C C C C C C C C C C C C C C C C C C
charge: -0.144076 -0.053737 0.164577 0.296265 -0.113446 -0.081492 0.223388 -0.037570 0.152107 -0.070398 -0.120310 -0.096752 -0.089904 -0.058696 0.031533 0.011543 0.043672 0.005291 0.008047 0.004062 -0.074105
polarizability: 2.76196833e+02 -2.73615776e+00 2.00021867e+02 1.51121921e+00 -1.27783591e+00 1.64536790e+02
1716.lowfreq: -10.6923 -5.7786 -1.1150 -0.0002 0.0007 0.0008 16.1765 22.0399 31.9337
frequency: 8.9945 21.1437 31.7233 54.5151 62.1536 70.2862 98.8867 132.7336 134.9819 160.7742 194.4387 202.2235 215.7464 232.9643 242.3466 243.1650 247.2141 266.7322 277.1782 286.2637 291.9572 306.7158 309.9095 345.2578 355.9250 360.6471 373.7272 385.4272 396.6032 407.4815 414.0181 447.0452 448.2426 477.4405 496.9937 540.8735 570.7367 588.1549 643.1912 709.2710 752.0700 783.3295 792.9415 806.6370 809.0197 849.3841 850.8676 854.2955 857.5045 874.9667 907.2609 908.9406 932.2881 948.6127 956.0801 959.1420 960.5923 973.2520 975.6139 989.2081 993.5633 1028.8159 1044.7911 1047.6845 1069.6274 1079.0326 1082.9676 1093.6249 1109.1398 1121.0207 1131.2937 1136.4562 1143.8571 1151.4355 1153.6520 1165.7135 1186.8146 1192.6380 1201.7534 1212.7194 1217.8554 1248.9968 1252.7454 1263.3494 1265.6239 1270.4629 1277.3153 1286.7158 1303.3032 1309.2923 1311.6825 1323.1713 1327.8123 1331.2392 1333.9332 1339.7586 1344.5361 1345.3882 1348.4250 1352.3469 1359.6303 1360.0703 1375.6643 1377.9379 1387.3846 1397.5353 1438.2551 1450.2099 1452.4864 1459.1370 1460.8481 1462.7111 1464.4470 1466.2224 1466.9988 1469.2386 1474.0809 1479.3355 1480.0078 1481.5041 1485.7809 1491.0408 2270.4861 2811.2246 2814.7042 2829.5802 2953.2221 2963.4252 2965.6524 2969.1138 2970.7689 2973.1776 2978.7729 2979.3196 2982.3554 2985.9920 2986.5230 2987.2363 2988.1832 2996.8234 3016.9293 3028.9758 3030.0378 3036.0970 3036.5635 3043.2893 3047.5919 3052.9481 3055.5424 3056.0285 3063.1920 3066.4831 3070.5416 3071.4086 3076.0391 3483.0695
redmass: 3.6087 4.0993 3.0578 2.7508 3.1470 3.8020 2.5727 3.3407 2.9588 3.6800 2.6535 1.2161 2.7253 2.0614 1.5475 1.3861 1.1443 2.1343 3.0899 2.6962 2.5841 3.2139 3.3783 2.3407 2.0639 3.0759 2.6971 1.8056 1.5463 3.7328 2.4653 2.4651 2.8719 2.6596 2.4715 2.4684 2.2475 2.7321 3.2491 3.3250 3.7501 3.4907 2.9704 1.5761 2.7727 2.1621 2.2084 1.6442 1.8929 1.8696 1.8754 1.3471 1.8674 1.5314 1.4988 1.8937 1.2938 1.9936 1.8412 2.5073 2.0416 2.3748 2.2188 1.5455 1.9218 1.4641 2.2995 2.3255 2.2882 2.5851 1.4949 2.2815 2.3839 1.3669 2.2670 2.6828 1.8595 1.2941 1.4273 1.5148 1.2146 1.4064 1.3523 1.2296 1.3843 1.2908 1.3521 1.3691 1.3169 1.3064 1.3775 1.4232 1.2962 1.3529 1.4020 1.4234 1.4471 1.5394 1.5000 1.4127 1.5451 1.4260 1.2214 1.2100 1.4636 1.2066 1.0861 1.0826 1.0886 1.0725 1.0863 1.0799 1.0933 1.0776 1.0591 1.0641 1.0561 1.0754 1.0842 1.0563 1.0484 1.0556 11.7248 1.0707 1.0715 1.0690 1.0797 1.0365 1.0630 1.0704 1.0429 1.0610 1.0457 1.0630 1.0685 1.0671 1.0626 1.0605 1.0634 1.0844 1.0866 1.0984 1.0908 1.0939 1.0987 1.0995 1.1033 1.1005 1.0996 1.1035 1.0995 1.0990 1.0987 1.0992 1.0981 1.0650
irintensity: 0.1004 0.0678 0.4734 0.0593 0.4275 0.1417 0.4172 0.1430 1.6619 0.7298 0.7362 0.1024 1.2911 3.9299 1.1361 1.5709 1.0371 0.0550 5.3556 2.9416 2.9025 5.5889 1.5665 5.7954 25.9387 1.3660 1.0264 3.0260 57.8763 7.1881 20.5847 22.8368 1.7306 4.0697 1.2332 0.3084 1.0829 6.8249 10.7501 0.9808 10.3568 5.4112 3.3915 0.9163 8.0996 5.5348 2.2691 5.2844 5.5169 3.4966 2.2960 1.9778 3.5922 7.0792 3.4482 26.3431 3.2305 3.2276 3.3875 34.8590 7.6543 0.7320 9.7838 0.2286 8.3306 7.2107 10.5437 25.7255 11.2218 6.4637 2.3712 7.1107 2.2151 11.4614 0.9934 14.1153 5.7994 5.6162 7.2737 7.7370 7.3196 9.4046 1.6971 2.5391 10.8850 15.5924 9.5825 7.3125 3.1712 2.3426 6.0820 31.3499 25.7618 4.4041 12.7934 0.6148 2.8123 11.7182 1.1973 3.6636 10.6129 5.1432 10.5260 20.7862 6.7414 19.2531 5.7402 7.2447 4.0358 2.0143 12.7707 7.7358 10.9613 2.4996 1.4709 5.4358 17.1629 4.6749 3.6007 8.5888 11.2951 12.5567 3.7861 25.5483 48.5396 232.5353 22.0559 43.8044 37.7847 48.6045 12.9148 12.8230 40.4691 47.7240 6.2209 40.6520 15.1620 41.9992 41.0010 12.3744 74.3901 90.2393 30.0249 34.6689 42.8318 11.7596 18.9149 38.9739 29.1921 96.0077 19.4111 35.2313 60.2205 60.8711 74.9259 8.4663
temp: 298.150 k
press: 1.00000 atm
elementType: 8 7 6 6 6 6 6 6 6 6 6 6 6 6 6 6 6 6 6 6 6 1 1 1 1 1 1 1 1 1 1 1 1 1 1 1 1 1 1 1 1 1 1 1 1 1 1 1 1 1 1 1 1 1
symmnumber: 1
zpe: 1265520.3 jmol-1
zpe.correction: 0.482011 hartree
zpe.thermalcorrener: 0.505372 hartree
zpe.thermalcorrenthalpy: 0.506316 hartree
zpe.thermalcorrgfe: 0.428324 hartree
zpe.sumelectzpe: -872.031259 hartree
zpe.sumelectthermal: -872.007898 hartree
zpe.sumelectthermalent: -872.006953 hartree
zpe.sumelectthermalfe: -872.084946 hartree
dipole: -1.0831 -0.6912 0.6080
dipole: 1.4214
quadrupole: -119.1288 -129.6686 -135.4405
quadrupole: -0.6494 5.8478 1.8456
quadrupole: 8.9505 -1.5894 -7.3612 -0.6494 5.8478 1.8456
hfenergy: -872.5132697 hartree
pointgroup: C01 [X(C19H33N1O1)]
dipole: -0.4290096 -0.2556387 0.251663 debye
polarizability: 276.1265595|-3.5356822|199.8970475|1.5830048|-2.9398935|164.7318831 unknown
InChI: InChI=1S/C19H33NO/c1-16(2)18-10-9-17(3)15-19(18,21)11-5-8-14-20-12-6-4-7-13-20/h16-18,21H,4,6-7,9-15H2,1-3H3
charge 0 multiplicity 1
54 atoms
O  1.3325 0.142651 -1.693737
N  -3.550942 -0.849077 0.140055
C  3.394117 -0.104838 -0.455715
C  1.831651 -0.232349 -0.335478
C  1.25111 0.742944 0.718049
C  3.860796 1.345373 -0.115802
C  1.529701 2.248761 0.400495
C  2.800901 2.405575 -0.482258
C  4.242108 -1.189479 0.295013
C  1.34664 -1.701491 -0.077616
C  0.312265 2.949362 -0.246192
C  5.718833 -1.134923 -0.174957
C  4.188655 -1.12702 1.843892
C  -0.117206 -1.830981 -0.197671
C  -3.254233 0.415451 -0.580818
C  -5.010658 -1.124205 0.183842
C  -2.812287 -2.010158 -0.429028
C  -3.955048 1.611103 0.094083
C  -5.764174 0.024463 0.883955
C  -5.479948 1.373446 0.183997
C  -1.346192 -1.89006 -0.311134
H  3.578655 -0.26923 -1.537508
H  1.693843 0.483512 1.699814
H  0.160676 0.573358 0.815645
H  4.808277 1.553622 -0.647064
H  4.082372 1.430042 0.967406
H  1.730371 2.750561 1.370872
H  3.216512 3.424832 -0.355797
H  2.519783 2.287769 -1.544665
H  3.853121 -2.182269 -0.010415
H  1.668386 -2.048642 0.921941
H  1.826801 -2.36023 -0.827541
H  0.063579 2.467178 -1.209498
H  -0.579139 2.904261 0.40938
H  0.530591 4.015689 -0.448044
H  6.29822 -1.972291 0.257609
H  6.207428 -0.194623 0.140236
H  5.792497 -1.202945 -1.276839
H  4.657957 -0.203254 2.229072
H  3.157715 -1.168702 2.23872
H  4.7453 -1.980385 2.274718
H  0.354838 -0.045837 -1.70595
H  -3.583448 0.349739 -1.65345
H  -2.159216 0.565907 -0.578585
H  -5.170485 -2.072382 0.732002
H  -5.429256 -1.260322 -0.850485
H  -3.733873 2.533977 -0.47589
H  -3.539138 1.736878 1.112464
H  -5.42914 0.076878 1.937708
H  -6.849136 -0.195872 0.88558
H  -3.075758 -2.177841 -1.50775
H  -3.138468 -2.916405 0.118881
H  -5.971758 2.202793 0.726603
H  -5.910897 1.354889 -0.838848
