program: Gaussian 09
title: 000206388
version: EM64L-G09RevD.01
frameworkgroup: C1[X(C16H13NO2)]
method: RPBEPBE
basis: SDD
operation: Freq
keyword: #p
keyword: freq=noraman
keyword: PBEPBE/SDD
title: #p freq=noraman PBEPBE/SDD
converged: YES YES NO NO
title: Mulliken charges:
elementType: O O N C C C C C C C C C C C C C C C C H H H H H H H H H H H H H
charge: -0.241656 -0.241666 -0.074439 0.054189 0.310826 0.312927 0.312927 -0.191014 -0.191005 -0.316808 -0.316820 -0.347779 -0.208780 -0.208756 -0.422053 -0.422054 -0.223622 -0.223623 -0.645745 0.308761 0.308754 0.228131 0.228120 0.248036 0.248047 0.276947 0.276947 0.229835 0.229835 0.236028 0.236030 0.229480
chargesum: 0.00000
title: Mulliken charges with hydrogens summed into heavy atoms:
elementType: O O N C C C C C C C C C C C C C C C C
charge: -0.241656 -0.241666 -0.074439 0.054189 0.310826 0.312927 0.312927 -0.191014 -0.191005 -0.008047 -0.008066 0.108472 0.039257 0.039292 -0.145106 -0.145107 0.006213 0.006212 0.055792
polarizability: 4.06490437e+02 1.39674602e-03 1.86725894e+02 9.50648909e+00 -1.48972026e-03 8.24893918e+01
1716.lowfreq: -1.6422 -0.0010 -0.0009 -0.0007 1.3670 5.9299 33.6931 36.9331 77.0755
frequency: 33.6861 36.8741 77.0740 86.5039 106.3761 136.8014 162.7500 177.9686 205.3858 242.7182 251.8486 290.3678 296.7383 344.7400 395.0386 400.6631 424.1872 429.4314 459.2534 511.1045 522.0094 540.0497 567.2533 655.3034 659.3006 668.3668 697.2893 712.6927 745.8264 754.3318 788.3573 812.2074 826.0014 833.6097 839.3627 860.1135 864.8242 912.2586 965.9729 973.9294 987.5190 999.1811 999.9928 1007.5367 1026.1723 1055.7105 1073.2143 1082.5315 1093.5000 1122.3975 1155.4344 1166.8938 1187.7603 1190.4925 1208.9386 1232.8389 1254.2622 1279.5030 1311.3218 1338.2086 1388.3809 1393.2369 1409.3910 1419.4810 1447.9377 1449.4581 1464.5935 1468.4920 1476.5407 1491.2992 1519.5570 1556.4428 1560.7892 1582.6728 1611.5552 1612.8723 1653.4966 2993.7857 3015.8328 3069.9324 3095.1930 3102.8306 3128.4841 3144.2872 3153.5693 3155.4042 3156.2362 3166.0703 3172.6728 3177.6142
redmass: 4.8953 2.7514 5.0992 3.9814 3.9411 5.2611 6.4177 5.9097 1.1508 6.3487 5.3208 4.9893 4.1662 11.1293 3.5451 2.6492 3.1453 3.5319 4.7568 3.3887 7.4593 6.0017 7.0266 6.8544 4.8628 5.9445 7.3302 4.0860 4.2793 1.4796 1.1389 3.4913 2.1405 1.3368 6.4267 7.7817 2.2094 1.5491 2.2794 1.4519 1.2769 1.2749 1.3394 2.2439 2.9533 1.9174 2.4360 2.1259 3.6578 3.2908 1.4342 1.1220 2.3980 3.2789 1.3538 3.7949 1.2093 1.6250 1.6784 1.2774 1.8444 1.2043 5.2119 2.1802 2.4826 2.6804 1.4270 2.2454 1.0696 1.1023 6.2247 8.6044 5.4573 9.7813 7.7134 7.5625 6.2224 1.0356 1.0604 1.1038 1.0997 1.1027 1.0856 1.0901 1.0889 1.0914 1.0950 1.1000 1.0971 1.0995
irintensity: 4.2050 0.0115 3.1918 0.0348 2.9965 0.0005 4.1692 0.3826 0.0737 4.1107 0.0879 1.1880 0.8383 5.8571 1.6774 0.0956 0.0068 0.8604 0.0001 32.4996 7.6886 4.8217 2.8102 0.0058 0.0002 13.8655 0.0491 11.7741 2.0515 55.2179 3.1333 0.0128 67.7095 0.0527 80.2933 9.1604 40.6996 0.0000 2.1546 4.2800 6.0237 0.0077 0.0010 5.1992 2.4586 2.0932 3.4787 16.3348 4.2860 12.2468 11.1330 23.3701 7.8242 399.2246 0.2593 236.3879 5.1229 0.2584 14.8823 60.7439 15.7816 16.2368 273.5902 87.5940 0.0005 21.1584 18.4279 1.2424 2.7291 23.6047 79.6653 321.9788 674.4200 44.7840 5.7386 9.8826 750.4198 19.8341 48.0763 1.3987 49.6362 26.8123 2.6358 10.1381 5.9839 9.2840 10.9789 44.8269 1.5305 23.2863
temp: 298.150 k
press: 1.00000 atm
elementType: 8 8 7 6 6 6 6 6 6 6 6 6 6 6 6 6 6 6 6 1 1 1 1 1 1 1 1 1 1 1 1 1
symmnumber: 1
zpe: 652443.8 jmol-1
zpe.correction: 0.248503 hartree
zpe.thermalcorrener: 0.264192 hartree
zpe.thermalcorrenthalpy: 0.265136 hartree
zpe.thermalcorrgfe: 0.204586 hartree
zpe.sumelectzpe: -821.397606 hartree
zpe.sumelectthermal: -821.381917 hartree
zpe.sumelectthermalent: -821.380972 hartree
zpe.sumelectthermalfe: -821.441523 hartree
dipole: -7.6542 -0.0002 -0.0344
dipole: 7.6542
quadrupole: -54.1786 -117.7097 -113.9417
quadrupole: 0.0002 1.9244 0.0005
quadrupole: 41.0981 -22.4331 -18.6650 0.0002 1.9244 0.0005
hfenergy: -821.6461086 hartree
pointgroup: C01 [X(C16H13N1O2)]
dipole: -3.0113998 -0.0001255 -0.0085727 debye
polarizability: 406.6124866|-0.0082104|186.7251313|-7.1284046|-0.2823251|82.3681055 unknown
InChI: InChI=1S/C16H13NO2/c1-2-17-9-7-11(8-10-17)14-15(18)12-5-3-4-6-13(12)16(14)19/h3-10H,2H2,1H3
charge 0 multiplicity 1
32 atoms
O  0.827051 -2.431906 0.055746
O  0.82672 2.430836 0.042568
N  -3.966235 -0.000064 0.279602
C  0.30948 -0.000494 0.07328
C  -1.105485 -0.000372 0.139197
C  2.592859 -0.709609 -0.031072
C  2.592771 0.708319 -0.034953
C  1.169894 -1.201209 0.036755
C  1.169742 1.200104 0.030229
C  -1.878198 1.227018 0.174339
C  -1.878143 -1.227595 0.180835
C  -5.454017 -0.000167 0.262852
C  -3.259036 1.197428 0.238749
C  -3.258978 -1.197725 0.245115
C  3.792317 -1.437671 -0.08521
C  3.792137 1.436225 -0.093086
C  5.009397 -0.710396 -0.144128
C  5.009308 0.708791 -0.148027
C  -6.02727 -0.004417 -1.168763
H  -1.345182 2.181695 0.150811
H  -1.345081 -2.182356 0.162371
H  -5.799718 -0.888026 0.821633
H  -5.799799 0.890925 0.816403
H  -3.861091 2.109619 0.266439
H  -3.860993 -2.10978 0.277678
H  3.776822 -2.532297 -0.081518
H  3.776503 2.530852 -0.095375
H  5.963417 -1.247917 -0.187456
H  5.963261 1.246184 -0.194311
H  -5.700435 0.887513 -1.731026
H  -5.700043 -0.899451 -1.725835
H  -7.131273 -0.004553 -1.133044
